BDBM50300037 CHEMBL568963::N-Cyclohexyl-6,7-dimethoxy-2-(4-methyl-1,4-diazepan-1-yl)-quinazolin-4-amine::N-cyclohexyl-6,7-dimethoxy-2-(4-methyl-1,4-diazepan-1-yl)quinazolin-4-amine
SMILES: COc1cc2nc(nc(NC3CCCCC3)c2cc1OC)N1CCCN(C)CC1
InChI Key: InChIKey=LNWYXRGWPQSWGP-UHFFFAOYSA-N
Data: 2 IC50
Activity Spreadsheet -- Enzyme Inhibition Constant Data from BindingDB
Found 2 hits for monomerid = 50300037
Trg + Lig
Ki
nM
ΔG°
kcal/mole
IC50
nM
Kd
nM
EC50/IC50
nM
koff
s-1
kon
M-1s-1
pHTemp
°C
Protein G9a (G9a)
(Homo sapiens (Human))
BDBM50300037
(CHEMBL568963 | N-Cyclohexyl-6,7-dimethoxy-2-(4-met...)
Show SMILES COc1cc2nc(nc(NC3CCCCC3)c2cc1OC)N1CCCN(C)CC1
Show InChI InChI=1S/C22H33N5O2/c1-26-10-7-11-27(13-12-26)22-24-18-15-20(29-3)19(28-2)14-17(18)21(25-22)23-16-8-5-4-6-9-16/h14-16H,4-13H2,1-3H3,(H,23,24,25)
n/an/a>1.00E+7n/an/an/an/an/an/a
University of North Carolina at Chapel Hill
Curated by ChEMBL
Assay Description
Inhibition of methyl transferase activity of G9a assessed as inhibition of H3K9 methylation by chemiluminescence based oxygen tunneling assay
J Med Chem 53: 5844-57 (2010)
Article DOI: 10.1021/jm100478y
BindingDB Entry DOI: 10.7270/Q2DZ08H1
Protein G9a (G9a)
(Homo sapiens (Human))
BDBM50300037
(CHEMBL568963 | N-Cyclohexyl-6,7-dimethoxy-2-(4-met...)
Show SMILES COc1cc2nc(nc(NC3CCCCC3)c2cc1OC)N1CCCN(C)CC1
Show InChI InChI=1S/C22H33N5O2/c1-26-10-7-11-27(13-12-26)22-24-18-15-20(29-3)19(28-2)14-17(18)21(25-22)23-16-8-5-4-6-9-16/h14-16H,4-13H2,1-3H3,(H,23,24,25)
n/an/a>10n/an/an/an/an/an/a
University of North Carolina
Curated by ChEMBL
Assay Description
Inhibition of G9a by Alpha screen assay
J Med Chem 52: 7950-3 (2009)
Article DOI: 10.1021/jm901543m
BindingDB Entry DOI: 10.7270/Q2542NP4