BDBM50300044 CHEMBL578640::Octyl 6-oxo-5,6,7,12-tetrahydroindolo[3,2-d][1]benzazepine-9-carboxylate
SMILES: CCCCCCCCOC(=O)c1ccc2[nH]c-3c(CC(=O)Nc4ccccc-34)c2c1
InChI Key: InChIKey=GOYJYAUPYVFKTE-UHFFFAOYSA-N
Data: 3 IC50
Activity Spreadsheet -- Enzyme Inhibition Constant Data from BindingDB
Found 3 hits for monomerid = 50300044
Trg + Lig
Ki
nM
ΔG°
kcal/mole
IC50
nM
Kd
nM
EC50/IC50
nM
koff
s-1
kon
M-1s-1
pHTemp
°C
Malate dehydrogenase, mitochondrial
(Homo sapiens (Human))
BDBM50300044
(CHEMBL578640 | Octyl 6-oxo-5,6,7,12-tetrahydroindo...)
Show SMILES CCCCCCCCOC(=O)c1ccc2[nH]c-3c(CC(=O)Nc4ccccc-34)c2c1
Show InChI InChI=1S/C25H28N2O3/c1-2-3-4-5-6-9-14-30-25(29)17-12-13-22-19(15-17)20-16-23(28)26-21-11-8-7-10-18(21)24(20)27-22/h7-8,10-13,15,27H,2-6,9,14,16H2,1H3,(H,26,28)
Reactome pathway
n/an/a 2.70E+3n/an/an/an/an/an/a
Technische Universit£t Braunschweig
Curated by ChEMBL
Assay Description
Inhibition of mitochondrial malate dehydrogenase by spectrophotometry
Eur J Med Chem 45: 335-42 (2010)
Article DOI: 10.1016/j.ejmech.2009.10.018
BindingDB Entry DOI: 10.7270/Q26W9C1V
Glycogen synthase kinase-3 beta
(Homo sapiens (Human))
BDBM50300044
(CHEMBL578640 | Octyl 6-oxo-5,6,7,12-tetrahydroindo...)
Show SMILES CCCCCCCCOC(=O)c1ccc2[nH]c-3c(CC(=O)Nc4ccccc-34)c2c1
Show InChI InChI=1S/C25H28N2O3/c1-2-3-4-5-6-9-14-30-25(29)17-12-13-22-19(15-17)20-16-23(28)26-21-11-8-7-10-18(21)24(20)27-22/h7-8,10-13,15,27H,2-6,9,14,16H2,1H3,(H,26,28)
NCI pathway
Reactome pathway
n/an/a>1.00E+6n/an/an/an/an/an/a
Technische Universit£t Braunschweig
Curated by ChEMBL
Assay Description
Inhibition of GSK3-beta
Eur J Med Chem 45: 335-42 (2010)
Article DOI: 10.1016/j.ejmech.2009.10.018
BindingDB Entry DOI: 10.7270/Q26W9C1V
Cyclin B/Cyclin-Dependent Kinase 1 (CDK1)/G2/mitotic-specific cyclin B2/G2/mitotic-specific cyclin B3
(Homo sapiens (Human))
BDBM50300044
(CHEMBL578640 | Octyl 6-oxo-5,6,7,12-tetrahydroindo...)
Show SMILES CCCCCCCCOC(=O)c1ccc2[nH]c-3c(CC(=O)Nc4ccccc-34)c2c1
Show InChI InChI=1S/C25H28N2O3/c1-2-3-4-5-6-9-14-30-25(29)17-12-13-22-19(15-17)20-16-23(28)26-21-11-8-7-10-18(21)24(20)27-22/h7-8,10-13,15,27H,2-6,9,14,16H2,1H3,(H,26,28)
n/an/a 4.00E+4n/an/an/an/an/an/a
Technische Universit£t Braunschweig
Curated by ChEMBL
Assay Description
Inhibition of CDK1/cyclin B
Eur J Med Chem 45: 335-42 (2010)
Article DOI: 10.1016/j.ejmech.2009.10.018
BindingDB Entry DOI: 10.7270/Q26W9C1V