BDBM50300051 5-(3,4-Dichlorobenzyl)-7,12-dihydroindolo[3,2-d][1]benzazepin-6(5H)-one::CHEMBL575951
SMILES: Clc1ccc(CN2c3ccccc3-c3[nH]c4ccccc4c3CC2=O)cc1Cl
InChI Key: InChIKey=ROYHYYNQKVIOOR-UHFFFAOYSA-N
Data: 3 IC50
Activity Spreadsheet -- Enzyme Inhibition Constant Data from BindingDB
Found 3 hits for monomerid = 50300051
Trg + Lig
Ki
nM
ΔG°
kcal/mole
IC50
nM
Kd
nM
EC50/IC50
nM
koff
s-1
kon
M-1s-1
pHTemp
°C
Malate dehydrogenase, mitochondrial
(Homo sapiens (Human))
BDBM50300051
(5-(3,4-Dichlorobenzyl)-7,12-dihydroindolo[3,2-d][1...)
Show SMILES Clc1ccc(CN2c3ccccc3-c3[nH]c4ccccc4c3CC2=O)cc1Cl
Show InChI InChI=1S/C23H16Cl2N2O/c24-18-10-9-14(11-19(18)25)13-27-21-8-4-2-6-16(21)23-17(12-22(27)28)15-5-1-3-7-20(15)26-23/h1-11,26H,12-13H2
Reactome pathway
n/an/a 7.90E+3n/an/an/an/an/an/a
Technische Universit£t Braunschweig
Curated by ChEMBL
Assay Description
Inhibition of mitochondrial malate dehydrogenase by spectrophotometry
Eur J Med Chem 45: 335-42 (2010)
Article DOI: 10.1016/j.ejmech.2009.10.018
BindingDB Entry DOI: 10.7270/Q26W9C1V
Glycogen synthase kinase-3 beta
(Homo sapiens (Human))
BDBM50300051
(5-(3,4-Dichlorobenzyl)-7,12-dihydroindolo[3,2-d][1...)
Show SMILES Clc1ccc(CN2c3ccccc3-c3[nH]c4ccccc4c3CC2=O)cc1Cl
Show InChI InChI=1S/C23H16Cl2N2O/c24-18-10-9-14(11-19(18)25)13-27-21-8-4-2-6-16(21)23-17(12-22(27)28)15-5-1-3-7-20(15)26-23/h1-11,26H,12-13H2
NCI pathway
Reactome pathway
n/an/a>1.00E+4n/an/an/an/an/an/a
Technische Universit£t Braunschweig
Curated by ChEMBL
Assay Description
Inhibition of GSK3-beta
Eur J Med Chem 45: 335-42 (2010)
Article DOI: 10.1016/j.ejmech.2009.10.018
BindingDB Entry DOI: 10.7270/Q26W9C1V
Cyclin B/Cyclin-Dependent Kinase 1 (CDK1)/G2/mitotic-specific cyclin B2/G2/mitotic-specific cyclin B3
(Homo sapiens (Human))
BDBM50300051
(5-(3,4-Dichlorobenzyl)-7,12-dihydroindolo[3,2-d][1...)
Show SMILES Clc1ccc(CN2c3ccccc3-c3[nH]c4ccccc4c3CC2=O)cc1Cl
Show InChI InChI=1S/C23H16Cl2N2O/c24-18-10-9-14(11-19(18)25)13-27-21-8-4-2-6-16(21)23-17(12-22(27)28)15-5-1-3-7-20(15)26-23/h1-11,26H,12-13H2
n/an/a>1.00E+4n/an/an/an/an/an/a
Technische Universit£t Braunschweig
Curated by ChEMBL
Assay Description
Inhibition of CDK1/cyclin B
Eur J Med Chem 45: 335-42 (2010)
Article DOI: 10.1016/j.ejmech.2009.10.018
BindingDB Entry DOI: 10.7270/Q26W9C1V