null
SMILES: CCNC(=O)Nc1ccc(cc1)-c1nc(N2CC3CCC(C2)O3)c2cnn(C3CCN(CC3)C(=O)OC)c2n1
InChI Key: InChIKey=JHNAQAVZQKWQRE-UHFFFAOYSA-N
Activity Spreadsheet -- Enzyme Inhibition Constant Data from BindingDB
Found 2 hits for monomerid = 50300071
Trg + Lig
Ki
nM
ΔG°
kcal/mole
IC50
nM
Kd
nM
EC50/IC50
nM
koff
s-1
kon
M-1s-1
pHTemp
°C
Phosphatidylinositol 4,5-bisphosphate 3-kinase catalytic subunit alpha isoform
(Homo sapiens (Human))
BDBM50300071
(CHEMBL577137 | methyl 4-(4-(8-oxa-3-azabicyclo[3.2...)
Show SMILES CCNC(=O)Nc1ccc(cc1)-c1nc(N2CC3CCC(C2)O3)c2cnn(C3CCN(CC3)C(=O)OC)c2n1
Show InChI InChI=1S/C27H34N8O4/c1-3-28-26(36)30-18-6-4-17(5-7-18)23-31-24(34-15-20-8-9-21(16-34)39-20)22-14-29-35(25(22)32-23)19-10-12-33(13-11-19)27(37)38-2/h4-7,14,19-21H,3,8-13,15-16H2,1-2H3,(H2,28,30,36)
NCI pathway
Reactome pathway
n/an/a 5.33E+3n/an/an/an/an/an/a
Wyeth Research
Curated by ChEMBL
Assay Description
Inhibition of PI3Kalpha
J Med Chem 52: 7942-5 (2009)
Article DOI: 10.1021/jm901415x
BindingDB Entry DOI: 10.7270/Q2WM1DGH
Serine/threonine-protein kinase mTOR
(Homo sapiens (Human))
BDBM50300071
(CHEMBL577137 | methyl 4-(4-(8-oxa-3-azabicyclo[3.2...)
Show SMILES CCNC(=O)Nc1ccc(cc1)-c1nc(N2CC3CCC(C2)O3)c2cnn(C3CCN(CC3)C(=O)OC)c2n1
Show InChI InChI=1S/C27H34N8O4/c1-3-28-26(36)30-18-6-4-17(5-7-18)23-31-24(34-15-20-8-9-21(16-34)39-20)22-14-29-35(25(22)32-23)19-10-12-33(13-11-19)27(37)38-2/h4-7,14,19-21H,3,8-13,15-16H2,1-2H3,(H2,28,30,36)
NCI pathway
Reactome pathway
n/an/a 0.200n/an/an/an/an/an/a
Wyeth Research
Curated by ChEMBL
Assay Description
Inhibition of Flag-tagged human mTOR by DELFIA method
J Med Chem 52: 7942-5 (2009)
Article DOI: 10.1021/jm901415x
BindingDB Entry DOI: 10.7270/Q2WM1DGH