BDBM50300118 (2'R,3S,4'S,5'R)-6-chloro-4'-(3-chloro-2-fluorophenyl)-N-(2-(1-methylpiperidin-4-yl)ethyl)-2'-neopentyl-2-oxospiro[indoline-3,3'-pyrrolidine]-5'-carboxamide::CHEMBL575121
SMILES: CN1CCC(CCNC(=O)[C@@H]2N[C@H](CC(C)(C)C)[C@@]3([C@H]2c2cccc(Cl)c2F)C(=O)Nc2cc(Cl)ccc32)CC1
InChI Key: InChIKey=COBIADBVPGXSFP-OHMLLRHZSA-N
Data: 1 KI  1 IC50
Activity Spreadsheet -- Enzyme Inhibition Constant Data from BindingDB
Found 2 hits for monomerid = 50300118
Trg + Lig
Ki
nM
ΔG°
kcal/mole
IC50
nM
Kd
nM
EC50/IC50
nM
koff
s-1
kon
M-1s-1
pHTemp
°C
MDM2-MDMX
(Homo sapiens (Human))
BDBM50300118
((2'R,3S,4'S,5'R)-6-chloro-4'-(3-chloro-2-fluorophe...)
Show SMILES CN1CCC(CCNC(=O)[C@@H]2N[C@H](CC(C)(C)C)[C@@]3([C@H]2c2cccc(Cl)c2F)C(=O)Nc2cc(Cl)ccc32)CC1 |r|
Show InChI InChI=1S/C31H39Cl2FN4O2/c1-30(2,3)17-24-31(21-9-8-19(32)16-23(21)36-29(31)40)25(20-6-5-7-22(33)26(20)34)27(37-24)28(39)35-13-10-18-11-14-38(4)15-12-18/h5-9,16,18,24-25,27,37H,10-15,17H2,1-4H3,(H,35,39)(H,36,40)/t24-,25+,27-,31+/m1/s1
NCI pathway
Reactome pathway
2n/an/an/an/an/an/an/an/a
University of Michigan
Curated by ChEMBL
Assay Description
Inhibition of his-tagged human recombinant MDM2 binding to p53-based peptide PMDM6-F by fluorescence polarization assay
J Med Chem 52: 7970-3 (2009)
Article DOI: 10.1021/jm901400z
BindingDB Entry DOI: 10.7270/Q2N29X17
MDM2-MDMX
(Homo sapiens (Human))
BDBM50300118
((2'R,3S,4'S,5'R)-6-chloro-4'-(3-chloro-2-fluorophe...)
Show SMILES CN1CCC(CCNC(=O)[C@@H]2N[C@H](CC(C)(C)C)[C@@]3([C@H]2c2cccc(Cl)c2F)C(=O)Nc2cc(Cl)ccc32)CC1 |r|
Show InChI InChI=1S/C31H39Cl2FN4O2/c1-30(2,3)17-24-31(21-9-8-19(32)16-23(21)36-29(31)40)25(20-6-5-7-22(33)26(20)34)27(37-24)28(39)35-13-10-18-11-14-38(4)15-12-18/h5-9,16,18,24-25,27,37H,10-15,17H2,1-4H3,(H,35,39)(H,36,40)/t24-,25+,27-,31+/m1/s1
NCI pathway
Reactome pathway
n/an/a 32.4n/an/an/an/an/an/a
University of Michigan
Curated by ChEMBL
Assay Description
Inhibition of his-tagged human recombinant MDM2 binding to p53-based peptide PMDM6-F by fluorescence polarization assay
J Med Chem 52: 7970-3 (2009)
Article DOI: 10.1021/jm901400z
BindingDB Entry DOI: 10.7270/Q2N29X17