BDBM50300121 (2'R,3S,4'R,5'R)-6-chloro-4'-(3-chlorophenyl)-N-((S)-3,4-dihydroxybutyl)-5-fluoro-2'-neopentyl-2-oxospiro[indoline-3,3'-pyrrolidine]-5'-carboxamide::CHEMBL572933::US8680132, MI- 219
SMILES: CC(C)(C)C[C@H]1N[C@H]([C@H](c2cccc(Cl)c2)[C@@]11C(=O)Nc2cc(Cl)c(F)cc12)C(=O)NCC[C@H](O)CO
InChI Key: InChIKey=UNXQGBMZYKHQCO-NVHWNKAKSA-N
Data: 4 KI  3 IC50
Activity Spreadsheet -- Enzyme Inhibition Constant Data from BindingDB
Found 7 hits for monomerid = 50300121
Trg + Lig
Ki
nM
ΔG°
kcal/mole
IC50
nM
Kd
nM
EC50/IC50
nM
koff
s-1
kon
M-1s-1
pHTemp
°C
MDM2-MDMX
(Homo sapiens (Human))
BDBM50300121
((2'R,3S,4'R,5'R)-6-chloro-4'-(3-chlorophenyl)-N-((...)
Show SMILES CC(C)(C)C[C@H]1N[C@H]([C@H](c2cccc(Cl)c2)[C@@]11C(=O)Nc2cc(Cl)c(F)cc12)C(=O)NCC[C@H](O)CO |r|
Show InChI InChI=1S/C27H32Cl2FN3O4/c1-26(2,3)12-21-27(17-10-19(30)18(29)11-20(17)32-25(27)37)22(14-5-4-6-15(28)9-14)23(33-21)24(36)31-8-7-16(35)13-34/h4-6,9-11,16,21-23,33-35H,7-8,12-13H2,1-3H3,(H,31,36)(H,32,37)/t16-,21+,22-,23+,27-/m0/s1
NCI pathway
Reactome pathway
5n/an/an/an/an/an/an/an/a
TBA
Curated by ChEMBL
Assay Description
Binding affinity to MDM2
Eur J Med Chem 56: 10-16 (2012)
Article DOI: 10.1016/j.ejmech.2012.08.003
BindingDB Entry DOI: 10.7270/Q2K938SR
MDM2-MDMX
(Homo sapiens (Human))
BDBM50300121
((2'R,3S,4'R,5'R)-6-chloro-4'-(3-chlorophenyl)-N-((...)
Show SMILES CC(C)(C)C[C@H]1N[C@H]([C@H](c2cccc(Cl)c2)[C@@]11C(=O)Nc2cc(Cl)c(F)cc12)C(=O)NCC[C@H](O)CO |r|
Show InChI InChI=1S/C27H32Cl2FN3O4/c1-26(2,3)12-21-27(17-10-19(30)18(29)11-20(17)32-25(27)37)22(14-5-4-6-15(28)9-14)23(33-21)24(36)31-8-7-16(35)13-34/h4-6,9-11,16,21-23,33-35H,7-8,12-13H2,1-3H3,(H,31,36)(H,32,37)/t16-,21+,22-,23+,27-/m0/s1
NCI pathway
Reactome pathway
11n/an/an/an/an/an/an/an/a
University of Michigan
Curated by ChEMBL
Assay Description
Binding affinity to recombinant human His-tagged MDM2 (1 to 118 amino acids) using p53-based PMDM6-F as probe after 15 mins by competition assay
J Med Chem 56: 5553-61 (2014)
Article DOI: 10.1021/jm4005708
BindingDB Entry DOI: 10.7270/Q2SJ1N2D
MDM2-MDMX
(Homo sapiens (Human))
BDBM50300121
((2'R,3S,4'R,5'R)-6-chloro-4'-(3-chlorophenyl)-N-((...)
Show SMILES CC(C)(C)C[C@H]1N[C@H]([C@H](c2cccc(Cl)c2)[C@@]11C(=O)Nc2cc(Cl)c(F)cc12)C(=O)NCC[C@H](O)CO |r|
Show InChI InChI=1S/C27H32Cl2FN3O4/c1-26(2,3)12-21-27(17-10-19(30)18(29)11-20(17)32-25(27)37)22(14-5-4-6-15(28)9-14)23(33-21)24(36)31-8-7-16(35)13-34/h4-6,9-11,16,21-23,33-35H,7-8,12-13H2,1-3H3,(H,31,36)(H,32,37)/t16-,21+,22-,23+,27-/m0/s1
NCI pathway
Reactome pathway
13.1n/an/an/an/an/an/an/an/a
University of Michigan
Curated by ChEMBL
Assay Description
Inhibition of his-tagged human recombinant MDM2 binding to p53-based peptide PMDM6-F by fluorescence polarization assay
J Med Chem 52: 7970-3 (2009)
Article DOI: 10.1021/jm901400z
BindingDB Entry DOI: 10.7270/Q2N29X17
MDM2-MDMX
(Homo sapiens (Human))
BDBM50300121
((2'R,3S,4'R,5'R)-6-chloro-4'-(3-chlorophenyl)-N-((...)
Show SMILES CC(C)(C)C[C@H]1N[C@H]([C@H](c2cccc(Cl)c2)[C@@]11C(=O)Nc2cc(Cl)c(F)cc12)C(=O)NCC[C@H](O)CO |r|
Show InChI InChI=1S/C27H32Cl2FN3O4/c1-26(2,3)12-21-27(17-10-19(30)18(29)11-20(17)32-25(27)37)22(14-5-4-6-15(28)9-14)23(33-21)24(36)31-8-7-16(35)13-34/h4-6,9-11,16,21-23,33-35H,7-8,12-13H2,1-3H3,(H,31,36)(H,32,37)/t16-,21+,22-,23+,27-/m0/s1
NCI pathway
Reactome pathway
24n/an/an/an/an/an/an/an/a
University of Michigan Comprehensive Cancer Center and Departments of Internal Medicine
Curated by ChEMBL
Assay Description
Binding affinity to MDM2 (unknown origin)
J Med Chem 58: 1038-52 (2015)
Article DOI: 10.1021/jm501092z
BindingDB Entry DOI: 10.7270/Q21G0NZ5
MDM2-MDMX
(Homo sapiens (Human))
BDBM50300121
((2'R,3S,4'R,5'R)-6-chloro-4'-(3-chlorophenyl)-N-((...)
Show SMILES CC(C)(C)C[C@H]1N[C@H]([C@H](c2cccc(Cl)c2)[C@@]11C(=O)Nc2cc(Cl)c(F)cc12)C(=O)NCC[C@H](O)CO |r|
Show InChI InChI=1S/C27H32Cl2FN3O4/c1-26(2,3)12-21-27(17-10-19(30)18(29)11-20(17)32-25(27)37)22(14-5-4-6-15(28)9-14)23(33-21)24(36)31-8-7-16(35)13-34/h4-6,9-11,16,21-23,33-35H,7-8,12-13H2,1-3H3,(H,31,36)(H,32,37)/t16-,21+,22-,23+,27-/m0/s1
NCI pathway
Reactome pathway
n/an/a 45n/an/an/an/an/an/a
University of Michigan
Curated by ChEMBL
Assay Description
Binding affinity to recombinant human His-tagged MDM2 (1 to 118 amino acids) using p53-based PMDM6-F as probe after 15 to 30 mins by fluorescence pol...
J Med Chem 56: 5553-61 (2014)
Article DOI: 10.1021/jm4005708
BindingDB Entry DOI: 10.7270/Q2SJ1N2D
MDM2-MDMX
(Homo sapiens (Human))
BDBM50300121
((2'R,3S,4'R,5'R)-6-chloro-4'-(3-chlorophenyl)-N-((...)
Show SMILES CC(C)(C)C[C@H]1N[C@H]([C@H](c2cccc(Cl)c2)[C@@]11C(=O)Nc2cc(Cl)c(F)cc12)C(=O)NCC[C@H](O)CO |r|
Show InChI InChI=1S/C27H32Cl2FN3O4/c1-26(2,3)12-21-27(17-10-19(30)18(29)11-20(17)32-25(27)37)22(14-5-4-6-15(28)9-14)23(33-21)24(36)31-8-7-16(35)13-34/h4-6,9-11,16,21-23,33-35H,7-8,12-13H2,1-3H3,(H,31,36)(H,32,37)/t16-,21+,22-,23+,27-/m0/s1
NCI pathway
Reactome pathway
US Patent
n/an/a 180n/an/an/an/a7.5n/a
The Regents of the University of Michigan; Ascenta Licensing Corporation; Sanofi
US Patent
Assay Description
The binding affinity of the MDM2 inhibitors was determined using an optimized, sensitive and quantitative fluorescence polarization-based (FP-based) ...
US Patent US8680132 (2014)
BindingDB Entry DOI: 10.7270/Q27S7MD6
MDM2-MDMX
(Homo sapiens (Human))
BDBM50300121
((2'R,3S,4'R,5'R)-6-chloro-4'-(3-chlorophenyl)-N-((...)
Show SMILES CC(C)(C)C[C@H]1N[C@H]([C@H](c2cccc(Cl)c2)[C@@]11C(=O)Nc2cc(Cl)c(F)cc12)C(=O)NCC[C@H](O)CO |r|
Show InChI InChI=1S/C27H32Cl2FN3O4/c1-26(2,3)12-21-27(17-10-19(30)18(29)11-20(17)32-25(27)37)22(14-5-4-6-15(28)9-14)23(33-21)24(36)31-8-7-16(35)13-34/h4-6,9-11,16,21-23,33-35H,7-8,12-13H2,1-3H3,(H,31,36)(H,32,37)/t16-,21+,22-,23+,27-/m0/s1
NCI pathway
Reactome pathway
n/an/a 162n/an/an/an/an/an/a
University of Michigan
Curated by ChEMBL
Assay Description
Inhibition of his-tagged human recombinant MDM2 binding to p53-based peptide PMDM6-F by fluorescence polarization assay
J Med Chem 52: 7970-3 (2009)
Article DOI: 10.1021/jm901400z
BindingDB Entry DOI: 10.7270/Q2N29X17