BDBM50300126 CHEMBL574431::Sulfobromophthalein
SMILES: Oc1ccc(cc1S(O)(=O)=O)C1(OC(=O)c2c1c(Br)c(Br)c(Br)c2Br)c1ccc(O)c(c1)S(O)(=O)=O
InChI Key: InChIKey=OHTXTCNTQJFRIG-UHFFFAOYSA-N
Data: 1 IC50
Activity Spreadsheet -- Enzyme Inhibition Constant Data from BindingDB
Found 1 hit for monomerid = 50300126
Trg + Lig
Ki
nM
ΔG°
kcal/mole
IC50
nM
Kd
nM
EC50/IC50
nM
koff
s-1
kon
M-1s-1
pHTemp
°C
Prostaglandin D Synthase
(Homo sapiens (Human))
BDBM50300126
(CHEMBL574431 | Sulfobromophthalein)
Show SMILES Oc1ccc(cc1S(O)(=O)=O)C1(OC(=O)c2c1c(Br)c(Br)c(Br)c2Br)c1ccc(O)c(c1)S(O)(=O)=O
Show InChI InChI=1S/C20H10Br4O10S2/c21-15-13-14(16(22)18(24)17(15)23)20(34-19(13)27,7-1-3-9(25)11(5-7)35(28,29)30)8-2-4-10(26)12(6-8)36(31,32)33/h1-6,25-26H,(H,28,29,30)(H,31,32,33)
Reactome pathway
n/an/a 2.70E+4n/an/an/an/an/an/a
The University of Queensland
Curated by ChEMBL
Assay Description
Inhibition of human H-PGDS expressed in Escherichia coli BL21 assessed as rate of glutathione-chloro-dinitro benzene conjugation
Eur J Med Chem 45: 447-54 (2010)
Article DOI: 10.1016/j.ejmech.2009.10.025
BindingDB Entry DOI: 10.7270/Q2HD7VQT