BDBM50300211 2-(4-{[(4-Iodophenyl)amino]carbonothioyl}-1-piperazinyl)-8-ethyl-5-oxo-5,8-dihydropyrido[2,3-d]pyrimidine-6-carboxylic Acid::CHEMBL568949
SMILES: CCn1cc(C(O)=O)c(=O)c2cnc(nc12)N1CCN(CC1)C(=S)Nc1ccc(I)cc1
InChI Key: InChIKey=GYOHNVIPPJBIHB-UHFFFAOYSA-N
Data: 2 KI  1 IC50
Activity Spreadsheet -- Enzyme Inhibition Constant Data from BindingDB
Found 3 hits for monomerid = 50300211
Trg + Lig
Ki
nM
ΔG°
kcal/mole
IC50
nM
Kd
nM
EC50/IC50
nM
koff
s-1
kon
M-1s-1
pHTemp
°C
Ectonucleotide pyrophosphatase/phosphodiesterase family member 2
(Homo sapiens (Human))
BDBM50300211
(2-(4-{[(4-Iodophenyl)amino]carbonothioyl}-1-pipera...)
Show SMILES CCn1cc(C(O)=O)c(=O)c2cnc(nc12)N1CCN(CC1)C(=S)Nc1ccc(I)cc1
Show InChI InChI=1S/C21H21IN6O3S/c1-2-26-12-16(19(30)31)17(29)15-11-23-20(25-18(15)26)27-7-9-28(10-8-27)21(32)24-14-5-3-13(22)4-6-14/h3-6,11-12H,2,7-10H2,1H3,(H,24,32)(H,30,31)
13n/an/an/an/an/an/an/an/a
The University of Memphis
Curated by ChEMBL
Assay Description
Mixed type inhibition of human autotaxin at free state isolated from MDA-MB-231 cells assessed as blockade of FS3 substrate hydrolysis by FRET assay
J Med Chem 53: 1056-66 (2010)
Article DOI: 10.1021/jm9012328
BindingDB Entry DOI: 10.7270/Q2BP02VN
Ectonucleotide pyrophosphatase/phosphodiesterase family member 2
(Homo sapiens (Human))
BDBM50300211
(2-(4-{[(4-Iodophenyl)amino]carbonothioyl}-1-pipera...)
Show SMILES CCn1cc(C(O)=O)c(=O)c2cnc(nc12)N1CCN(CC1)C(=S)Nc1ccc(I)cc1
Show InChI InChI=1S/C21H21IN6O3S/c1-2-26-12-16(19(30)31)17(29)15-11-23-20(25-18(15)26)27-7-9-28(10-8-27)21(32)24-14-5-3-13(22)4-6-14/h3-6,11-12H,2,7-10H2,1H3,(H,24,32)(H,30,31)
34n/an/an/an/an/an/an/an/a
The University of Memphis
Curated by ChEMBL
Assay Description
Mixed type inhibition of human autotaxin at enzyme-substrate complex isolated from MDA-MB-231 cells assessed as blockade of FS3 substrate hydrolysis ...
J Med Chem 53: 1056-66 (2010)
Article DOI: 10.1021/jm9012328
BindingDB Entry DOI: 10.7270/Q2BP02VN
Ectonucleotide pyrophosphatase/phosphodiesterase family member 2
(Homo sapiens (Human))
BDBM50300211
(2-(4-{[(4-Iodophenyl)amino]carbonothioyl}-1-pipera...)
Show SMILES CCn1cc(C(O)=O)c(=O)c2cnc(nc12)N1CCN(CC1)C(=S)Nc1ccc(I)cc1
Show InChI InChI=1S/C21H21IN6O3S/c1-2-26-12-16(19(30)31)17(29)15-11-23-20(25-18(15)26)27-7-9-28(10-8-27)21(32)24-14-5-3-13(22)4-6-14/h3-6,11-12H,2,7-10H2,1H3,(H,24,32)(H,30,31)
n/an/a 5.60n/an/an/an/an/an/a
The University of Memphis
Curated by ChEMBL
Assay Description
Inhibition of human autotaxin isolated from MDA-MB-231 cells assessed as blockade of FS3 substrate hydrolysis by FRET assay
J Med Chem 53: 1056-66 (2010)
Article DOI: 10.1021/jm9012328
BindingDB Entry DOI: 10.7270/Q2BP02VN