BDBM50300504 CHEMBL574455::N-({3-[(5S)-5-tert-butyl-1-[(4-fluorophenyl)methyl]-4-hydroxy-2-oxo-2,5-dihydro-1H-pyrrol-3-yl]-1,1-dioxo-{6},2-benzothiazol-7-yl}methyl)-N-methylaminosulfonamide
SMILES: CN(Cc1cccc2C(NS(=O)(=O)c12)=C1C(=O)[C@@H](N(Cc2ccc(F)cc2)C1=O)C(C)(C)C)S(N)(=O)=O
InChI Key: InChIKey=DXDWFDRBXRDVNN-JOCHJYFZSA-N
Data: 1 IC50
Activity Spreadsheet -- Enzyme Inhibition Constant Data from BindingDB
Found 1 hit for monomerid = 50300504
Trg + Lig
Ki
nM
ΔG°
kcal/mole
IC50
nM
Kd
nM
EC50/IC50
nM
koff
s-1
kon
M-1s-1
pHTemp
°C
RNA polymerase (NS5B)
(Hepatitis C virus (HCV))
BDBM50300504
(CHEMBL574455 | N-({3-[(5S)-5-tert-butyl-1-[(4-fluo...)
Show SMILES CN(Cc1cccc2C(NS(=O)(=O)c12)=C1C(=O)[C@@H](N(Cc2ccc(F)cc2)C1=O)C(C)(C)C)S(N)(=O)=O |r,w:14.16|
Show InChI InChI=1S/C24H27FN4O6S2/c1-24(2,3)22-20(30)18(23(31)29(22)12-14-8-10-16(25)11-9-14)19-17-7-5-6-15(13-28(4)37(26,34)35)21(17)36(32,33)27-19/h5-11,22,27H,12-13H2,1-4H3,(H2,26,34,35)/t22-/m1/s1
n/an/a 1n/an/an/an/an/an/a
Roche Palo Alto LLC
Curated by ChEMBL
Assay Description
Inhibition of HSV1b con1 NS5B polymerase assessed as [3H]UTP incorporation into acid insoluble RNA product
Bioorg Med Chem Lett 19: 5652-6 (2009)
Article DOI: 10.1016/j.bmcl.2009.08.022
BindingDB Entry DOI: 10.7270/Q2N016K0