BDBM50300515 (1S,2R)-1-(5-fluoro-1H-indol-1-yl)-1-(3-fluorophenyl)-3-(methylamino)propan-2-ol::CHEMBL577597
SMILES: CNC[C@@H](O)[C@H](c1cccc(F)c1)n1ccc2cc(F)ccc12
InChI Key: InChIKey=DQPHXSWTVKEOEO-MSOLQXFVSA-N
Data: 2 IC50
Activity Spreadsheet -- Enzyme Inhibition Constant Data from BindingDB
Found 2 hits for monomerid = 50300515
Trg + Lig
Ki
nM
ΔG°
kcal/mole
IC50
nM
Kd
nM
EC50/IC50
nM
koff
s-1
kon
M-1s-1
pHTemp
°C
Sodium-dependent noradrenaline transporter
(Homo sapiens (Human))
BDBM50300515
((1S,2R)-1-(5-fluoro-1H-indol-1-yl)-1-(3-fluorophen...)
Show SMILES CNC[C@@H](O)[C@H](c1cccc(F)c1)n1ccc2cc(F)ccc12 |r|
Show InChI InChI=1S/C18H18F2N2O/c1-21-11-17(23)18(13-3-2-4-14(19)10-13)22-8-7-12-9-15(20)5-6-16(12)22/h2-10,17-18,21,23H,11H2,1H3/t17-,18+/m1/s1
Reactome pathway
n/an/a 22n/an/an/an/an/an/a
Wyeth Research
Curated by ChEMBL
Assay Description
Inhibition of human NET expressed in MDCK-Net6 cells
Bioorg Med Chem Lett 19: 5807-10 (2009)
Article DOI: 10.1016/j.bmcl.2009.07.050
BindingDB Entry DOI: 10.7270/Q2H70FV8
Sodium-dependent serotonin transporter
(Homo sapiens (Human))
BDBM50300515
((1S,2R)-1-(5-fluoro-1H-indol-1-yl)-1-(3-fluorophen...)
Show SMILES CNC[C@@H](O)[C@H](c1cccc(F)c1)n1ccc2cc(F)ccc12 |r|
Show InChI InChI=1S/C18H18F2N2O/c1-21-11-17(23)18(13-3-2-4-14(19)10-13)22-8-7-12-9-15(20)5-6-16(12)22/h2-10,17-18,21,23H,11H2,1H3/t17-,18+/m1/s1
n/an/a 78n/an/an/an/an/an/a
Wyeth Research
Curated by ChEMBL
Assay Description
Inhibition of human SERT expressed in JAR cells
Bioorg Med Chem Lett 19: 5807-10 (2009)
Article DOI: 10.1016/j.bmcl.2009.07.050
BindingDB Entry DOI: 10.7270/Q2H70FV8