BDBM50300697 CHEMBL574039::N-(5-tert-Butyl-isoxazol-3-yl)-N'-(4-{7-[3-(4-methylpiperazin-1-yl)propoxy]imidazo[2,1-b][1,3]benzothiazol-2-yl}phenyl)urea
SMILES: CN1CCN(CCCOc2ccc3c(c2)sc2nc(cn32)-c2ccc(NC(=O)Nc3cc(on3)C(C)(C)C)cc2)CC1
InChI Key: InChIKey=DTOKHNAODOAINH-UHFFFAOYSA-N
Data: 1 Kd
Activity Spreadsheet -- Enzyme Inhibition Constant Data from BindingDB
Found 1 hit for monomerid = 50300697
Trg + Lig
Ki
nM
ΔG°
kcal/mole
IC50
nM
Kd
nM
EC50/IC50
nM
koff
s-1
kon
M-1s-1
pHTemp
°C
Receptor-type tyrosine-protein kinase FLT3
(Homo sapiens (Human))
BDBM50300697
(CHEMBL574039 | N-(5-tert-Butyl-isoxazol-3-yl)-N'-(...)
Show SMILES CN1CCN(CCCOc2ccc3c(c2)sc2nc(cn32)-c2ccc(NC(=O)Nc3cc(on3)C(C)(C)C)cc2)CC1
Show InChI InChI=1S/C31H37N7O3S/c1-31(2,3)27-19-28(35-41-27)34-29(39)32-22-8-6-21(7-9-22)24-20-38-25-11-10-23(18-26(25)42-30(38)33-24)40-17-5-12-37-15-13-36(4)14-16-37/h6-11,18-20H,5,12-17H2,1-4H3,(H2,32,34,35,39)
n/an/an/a 1.70n/an/an/an/an/a
Ambit Biosciences
Curated by ChEMBL
Assay Description
Binding affinity to FLT3 catalytic domain expressed in HEK293 cells by competitive binding assay
J Med Chem 52: 7808-16 (2009)
Article DOI: 10.1021/jm9007533
BindingDB Entry DOI: 10.7270/Q2319VZ6