BDBM50300702 3-(2-{4-[3-(5-tert-Butyl-isoxazol-3-yl)ureido]phenyl}imidazo[2,1-b][1,3]benzothiazol-7-yl)propanoate::CHEMBL583418
SMILES: CC(C)(C)c1cc(NC(=O)Nc2ccc(cc2)-c2cn3c(n2)sc2cc(CCC(O)=O)ccc32)no1
InChI Key: InChIKey=VSGYDCXNJDAQFA-UHFFFAOYSA-N
Data: 1 Kd
Activity Spreadsheet -- Enzyme Inhibition Constant Data from BindingDB
Found 1 hit for monomerid = 50300702
Trg + Lig
Ki
nM
ΔG°
kcal/mole
IC50
nM
Kd
nM
EC50/IC50
nM
koff
s-1
kon
M-1s-1
pHTemp
°C
Receptor-type tyrosine-protein kinase FLT3
(Homo sapiens (Human))
BDBM50300702
(3-(2-{4-[3-(5-tert-Butyl-isoxazol-3-yl)ureido]phen...)
Show SMILES CC(C)(C)c1cc(NC(=O)Nc2ccc(cc2)-c2cn3c(n2)sc2cc(CCC(O)=O)ccc32)no1
Show InChI InChI=1S/C26H25N5O4S/c1-26(2,3)21-13-22(30-35-21)29-24(34)27-17-8-6-16(7-9-17)18-14-31-19-10-4-15(5-11-23(32)33)12-20(19)36-25(31)28-18/h4,6-10,12-14H,5,11H2,1-3H3,(H,32,33)(H2,27,29,30,34)
n/an/an/a 1.30n/an/an/an/an/a
Ambit Biosciences
Curated by ChEMBL
Assay Description
Binding affinity to FLT3 catalytic domain expressed in HEK293 cells by competitive binding assay
J Med Chem 52: 7808-16 (2009)
Article DOI: 10.1021/jm9007533
BindingDB Entry DOI: 10.7270/Q2319VZ6