BDBM50300852 4,6-dichloro-N-(4-isopropylphenyl)-1,3,5-triazin-2-amine::CHEMBL584211
SMILES: CC(C)c1ccc(Nc2nc(Cl)nc(Cl)n2)cc1
InChI Key: InChIKey=HZIYJENFXOPSFC-UHFFFAOYSA-N
Data: 1 IC50
Activity Spreadsheet -- Enzyme Inhibition Constant Data from BindingDB
Found 1 hit for monomerid = 50300852
Trg + Lig
Ki
nM
ΔG°
kcal/mole
IC50
nM
Kd
nM
EC50/IC50
nM
koff
s-1
kon
M-1s-1
pHTemp
°C
Nuclear factor NF-kappa-B (NF-kB)
(Homo sapiens (Human))
BDBM50300852
(4,6-dichloro-N-(4-isopropylphenyl)-1,3,5-triazin-2...)
Show SMILES CC(C)c1ccc(Nc2nc(Cl)nc(Cl)n2)cc1
Show InChI InChI=1S/C12H12Cl2N4/c1-7(2)8-3-5-9(6-4-8)15-12-17-10(13)16-11(14)18-12/h3-7H,1-2H3,(H,15,16,17,18)
n/an/a 7.44E+4n/an/an/an/an/an/a
Tokushima Bunri University
Curated by ChEMBL
Assay Description
Inhibition of GST-fused human NFkappaB p50 subunit DNA binding activity assessed as shortened diffusion time by fluorescence correlation spectroscopy
Bioorg Med Chem 17: 5293-7 (2009)
Article DOI: 10.1016/j.bmc.2009.05.030
BindingDB Entry DOI: 10.7270/Q2222TVT