null
SMILES: CCS(=O)(=O)CCN([C@H](C)c1nc2nc(C)ccc2c(=O)n1-c1ccc(cc1)C#N)C(=O)Cc1ccc(F)c(c1)C(F)(F)F
InChI Key: InChIKey=RFXPVEJYQNWYRF-LJQANCHMSA-N
Activity Spreadsheet -- Enzyme Inhibition Constant Data from BindingDB
Found 3 hits for monomerid = 50300910
Trg + Lig
Ki
nM
ΔG°
kcal/mole
IC50
nM
Kd
nM
EC50/IC50
nM
koff
s-1
kon
M-1s-1
pHTemp
°C
C-X-C chemokine receptor type 3
(Homo sapiens (Human))
BDBM50300910
((R)-N-(1-(3-(4-cyanophenyl)-7-methyl-4-oxo-3,4-dih...)
Show SMILES CCS(=O)(=O)CCN([C@H](C)c1nc2nc(C)ccc2c(=O)n1-c1ccc(cc1)C#N)C(=O)Cc1ccc(F)c(c1)C(F)(F)F |r|
Show InChI InChI=1S/C30H27F4N5O4S/c1-4-44(42,43)14-13-38(26(40)16-21-8-12-25(31)24(15-21)30(32,33)34)19(3)28-37-27-23(11-5-18(2)36-27)29(41)39(28)22-9-6-20(17-35)7-10-22/h5-12,15,19H,4,13-14,16H2,1-3H3/t19-/m1/s1
n/an/a 30n/an/an/an/an/an/a
Amgen Inc.
Curated by ChEMBL
Assay Description
Antagonistic activity to CXCR3 receptor expressed in PBMC assessed as inhibition of ITAC-mediated cell migration in presence of 100% human plasma
Bioorg Med Chem Lett 19: 5200-4 (2009)
Article DOI: 10.1016/j.bmcl.2009.07.021
BindingDB Entry DOI: 10.7270/Q2W95980
C-X-C chemokine receptor type 3
(Homo sapiens (Human))
BDBM50300910
((R)-N-(1-(3-(4-cyanophenyl)-7-methyl-4-oxo-3,4-dih...)
Show SMILES CCS(=O)(=O)CCN([C@H](C)c1nc2nc(C)ccc2c(=O)n1-c1ccc(cc1)C#N)C(=O)Cc1ccc(F)c(c1)C(F)(F)F |r|
Show InChI InChI=1S/C30H27F4N5O4S/c1-4-44(42,43)14-13-38(26(40)16-21-8-12-25(31)24(15-21)30(32,33)34)19(3)28-37-27-23(11-5-18(2)36-27)29(41)39(28)22-9-6-20(17-35)7-10-22/h5-12,15,19H,4,13-14,16H2,1-3H3/t19-/m1/s1
n/an/a 12n/an/an/an/an/an/a
Amgen Inc.
Curated by ChEMBL
Assay Description
Displacement of [125I]IP10 from CXCR3 receptor expressed in PBMC in presence of human plasma
Bioorg Med Chem Lett 19: 5200-4 (2009)
Article DOI: 10.1016/j.bmcl.2009.07.021
BindingDB Entry DOI: 10.7270/Q2W95980
C-X-C chemokine receptor type 3
(Homo sapiens (Human))
BDBM50300910
((R)-N-(1-(3-(4-cyanophenyl)-7-methyl-4-oxo-3,4-dih...)
Show SMILES CCS(=O)(=O)CCN([C@H](C)c1nc2nc(C)ccc2c(=O)n1-c1ccc(cc1)C#N)C(=O)Cc1ccc(F)c(c1)C(F)(F)F |r|
Show InChI InChI=1S/C30H27F4N5O4S/c1-4-44(42,43)14-13-38(26(40)16-21-8-12-25(31)24(15-21)30(32,33)34)19(3)28-37-27-23(11-5-18(2)36-27)29(41)39(28)22-9-6-20(17-35)7-10-22/h5-12,15,19H,4,13-14,16H2,1-3H3/t19-/m1/s1
n/an/a 4n/an/an/an/an/an/a
Amgen Inc.
Curated by ChEMBL
Assay Description
Displacement of [125I]IP10 from CXCR3 receptor expressed in PBMC
Bioorg Med Chem Lett 19: 5200-4 (2009)
Article DOI: 10.1016/j.bmcl.2009.07.021
BindingDB Entry DOI: 10.7270/Q2W95980