BDBM50300955 3-(2-(dimethylamino)ethylamino)-7-(6-methoxypyridin-3-yl)-1-(2-propoxyethyl)pyrido[3,4-b]pyrazin-2(1H)-one::CHEMBL567229
SMILES: CCCOCCn1c2cc(ncc2nc(NCCN(C)C)c1=O)-c1ccc(OC)nc1
InChI Key: InChIKey=GVPJUOVLCBLQQT-UHFFFAOYSA-N
Data: 2 IC50
Activity Spreadsheet -- Enzyme Inhibition Constant Data from BindingDB
Found 2 hits for monomerid = 50300955
Trg + Lig
Ki
nM
ΔG°
kcal/mole
IC50
nM
Kd
nM
EC50/IC50
nM
koff
s-1
kon
M-1s-1
pHTemp
°C
Phosphodiesterase 6A
(Homo sapiens (Human))
BDBM50300955
(3-(2-(dimethylamino)ethylamino)-7-(6-methoxypyridi...)
Show SMILES CCCOCCn1c2cc(ncc2nc(NCCN(C)C)c1=O)-c1ccc(OC)nc1
Show InChI InChI=1S/C22H30N6O3/c1-5-11-31-12-10-28-19-13-17(16-6-7-20(30-4)25-14-16)24-15-18(19)26-21(22(28)29)23-8-9-27(2)3/h6-7,13-15H,5,8-12H2,1-4H3,(H,23,26)
NCI pathway
Reactome pathway
n/an/a 261n/an/an/an/an/an/a
Pfizer Global Research and Development
Curated by ChEMBL
Assay Description
Inhibition of PDE6
Bioorg Med Chem Lett 19: 5209-13 (2009)
Article DOI: 10.1016/j.bmcl.2009.07.019
BindingDB Entry DOI: 10.7270/Q2H41RHV
cGMP-specific 3',5'-cyclic phosphodiesterase
(Homo sapiens (Human))
BDBM50300955
(3-(2-(dimethylamino)ethylamino)-7-(6-methoxypyridi...)
Show SMILES CCCOCCn1c2cc(ncc2nc(NCCN(C)C)c1=O)-c1ccc(OC)nc1
Show InChI InChI=1S/C22H30N6O3/c1-5-11-31-12-10-28-19-13-17(16-6-7-20(30-4)25-14-16)24-15-18(19)26-21(22(28)29)23-8-9-27(2)3/h6-7,13-15H,5,8-12H2,1-4H3,(H,23,26)
Reactome pathway
n/an/a 0.780n/an/an/an/an/an/a
Pfizer Global Research and Development
Curated by ChEMBL
Assay Description
Inhibition of PDE5
Bioorg Med Chem Lett 19: 5209-13 (2009)
Article DOI: 10.1016/j.bmcl.2009.07.019
BindingDB Entry DOI: 10.7270/Q2H41RHV