BDBM50300982 7-(6-methoxypyridin-3-yl)-3-(2-(4-methylpiperazin-1-yl)-2-oxoethylamino)-1-(2-propoxyethyl)pyrido[2,3-b]pyrazin-2(1H)-one::CHEMBL584285
SMILES: CCCOCCn1c2cc(cnc2nc(NCC(=O)N2CCN(C)CC2)c1=O)-c1ccc(OC)nc1
InChI Key: InChIKey=VYLBTDDVUFATED-UHFFFAOYSA-N
Data: 2 IC50
Activity Spreadsheet -- Enzyme Inhibition Constant Data from BindingDB
Found 2 hits for monomerid = 50300982
Trg + Lig
Ki
nM
ΔG°
kcal/mole
IC50
nM
Kd
nM
EC50/IC50
nM
koff
s-1
kon
M-1s-1
pHTemp
°C
Phosphodiesterase 6A
(Homo sapiens (Human))
BDBM50300982
(7-(6-methoxypyridin-3-yl)-3-(2-(4-methylpiperazin-...)
Show SMILES CCCOCCn1c2cc(cnc2nc(NCC(=O)N2CCN(C)CC2)c1=O)-c1ccc(OC)nc1
Show InChI InChI=1S/C25H33N7O4/c1-4-12-36-13-11-32-20-14-19(18-5-6-21(35-3)26-15-18)16-27-23(20)29-24(25(32)34)28-17-22(33)31-9-7-30(2)8-10-31/h5-6,14-16H,4,7-13,17H2,1-3H3,(H,27,28,29)
NCI pathway
Reactome pathway
n/an/a 80n/an/an/an/an/an/a
Pfizer Global Research and Development
Curated by ChEMBL
Assay Description
Inhibition of PDE6
Bioorg Med Chem Lett 19: 5209-13 (2009)
Article DOI: 10.1016/j.bmcl.2009.07.019
BindingDB Entry DOI: 10.7270/Q2H41RHV
cGMP-specific 3',5'-cyclic phosphodiesterase
(Homo sapiens (Human))
BDBM50300982
(7-(6-methoxypyridin-3-yl)-3-(2-(4-methylpiperazin-...)
Show SMILES CCCOCCn1c2cc(cnc2nc(NCC(=O)N2CCN(C)CC2)c1=O)-c1ccc(OC)nc1
Show InChI InChI=1S/C25H33N7O4/c1-4-12-36-13-11-32-20-14-19(18-5-6-21(35-3)26-15-18)16-27-23(20)29-24(25(32)34)28-17-22(33)31-9-7-30(2)8-10-31/h5-6,14-16H,4,7-13,17H2,1-3H3,(H,27,28,29)
Reactome pathway
n/an/a 0.320n/an/an/an/an/an/a
Pfizer Global Research and Development
Curated by ChEMBL
Assay Description
Inhibition of PDE5
Bioorg Med Chem Lett 19: 5209-13 (2009)
Article DOI: 10.1016/j.bmcl.2009.07.019
BindingDB Entry DOI: 10.7270/Q2H41RHV