BDBM50300990 (R)-3-(2-hydroxypropylamino)-7-(6-methoxypyridin-3-yl)-1-(2-propoxyethyl)pyrido[2,3-b]pyrazin-2(1H)-one::CHEMBL585015
SMILES: CCCOCCn1c2cc(cnc2nc(NC[C@@H](C)O)c1=O)-c1ccc(OC)nc1
InChI Key: InChIKey=BXCRNDMBXFGKQP-CQSZACIVSA-N
Data: 2 IC50
Activity Spreadsheet -- Enzyme Inhibition Constant Data from BindingDB
Found 2 hits for monomerid = 50300990
Trg + Lig
Ki
nM
ΔG°
kcal/mole
IC50
nM
Kd
nM
EC50/IC50
nM
koff
s-1
kon
M-1s-1
pHTemp
°C
Phosphodiesterase 6A
(Homo sapiens (Human))
BDBM50300990
((R)-3-(2-hydroxypropylamino)-7-(6-methoxypyridin-3...)
Show SMILES CCCOCCn1c2cc(cnc2nc(NC[C@@H](C)O)c1=O)-c1ccc(OC)nc1 |r|
Show InChI InChI=1S/C21H27N5O4/c1-4-8-30-9-7-26-17-10-16(15-5-6-18(29-3)22-12-15)13-24-19(17)25-20(21(26)28)23-11-14(2)27/h5-6,10,12-14,27H,4,7-9,11H2,1-3H3,(H,23,24,25)/t14-/m1/s1
NCI pathway
Reactome pathway
n/an/a 50n/an/an/an/an/an/a
Pfizer Global Research and Development
Curated by ChEMBL
Assay Description
Inhibition of PDE6
Bioorg Med Chem Lett 19: 5209-13 (2009)
Article DOI: 10.1016/j.bmcl.2009.07.019
BindingDB Entry DOI: 10.7270/Q2H41RHV
cGMP-specific 3',5'-cyclic phosphodiesterase
(Homo sapiens (Human))
BDBM50300990
((R)-3-(2-hydroxypropylamino)-7-(6-methoxypyridin-3...)
Show SMILES CCCOCCn1c2cc(cnc2nc(NC[C@@H](C)O)c1=O)-c1ccc(OC)nc1 |r|
Show InChI InChI=1S/C21H27N5O4/c1-4-8-30-9-7-26-17-10-16(15-5-6-18(29-3)22-12-15)13-24-19(17)25-20(21(26)28)23-11-14(2)27/h5-6,10,12-14,27H,4,7-9,11H2,1-3H3,(H,23,24,25)/t14-/m1/s1
Reactome pathway
n/an/a 0.540n/an/an/an/an/an/a
Pfizer Global Research and Development
Curated by ChEMBL
Assay Description
Inhibition of PDE5
Bioorg Med Chem Lett 19: 5209-13 (2009)
Article DOI: 10.1016/j.bmcl.2009.07.019
BindingDB Entry DOI: 10.7270/Q2H41RHV