null
SMILES: [O-]c1[nH]c(=O)n(Cc2ccco2)c(=O)c1[CH+]c1ccc(o1)-c1cccc(c1)[N+]([O-])=O
InChI Key: InChIKey=PCGQSSNEUUIDKT-UHFFFAOYSA-N
Activity Spreadsheet -- Enzyme Inhibition Constant Data from BindingDB
Found 8 hits for monomerid = 50301
Trg + Lig
Ki
nM
ΔG°
kcal/mole
IC50
nM
Kd
nM
EC50/IC50
nM
koff
s-1
kon
M-1s-1
pHTemp
°C
Induced myeloid leukemia cell differentiation protein Mcl-1
(Homo sapiens (Human))
BDBM50301
((5E)-1-(2-furanylmethyl)-5-[[5-(3-nitrophenyl)-2-f...)
Show SMILES [O-]c1[nH]c(=O)n(Cc2ccco2)c(=O)c1[CH+]c1ccc(o1)-c1cccc(c1)[N+]([O-])=O
Show InChI InChI=1S/C20H13N3O7/c24-18-16(19(25)22(20(26)21-18)11-15-5-2-8-29-15)10-14-6-7-17(30-14)12-3-1-4-13(9-12)23(27)28/h1-10H,11H2,(H-,21,24,25,26)
NCI pathway
PCBioAssay
n/an/a 3.20E+3n/an/an/an/an/an/a
Emory University Molecular Libraries Screening Center
Curated by PubChem BioAssay
Assay Description
NIH Molecular Libraries Screening Centers Network [MLSCN] Emory Chemical Biology Discovery Center in MLSCN Assay provider: Nikolovska-Coleska, Univer...
PubChem Bioassay (2008)
BindingDB Entry DOI: 10.7270/Q23X8539
Glycoprotein 42
(Human herpesvirus 4 type 2)
BDBM50301
((5E)-1-(2-furanylmethyl)-5-[[5-(3-nitrophenyl)-2-f...)
Show SMILES [O-]c1[nH]c(=O)n(Cc2ccco2)c(=O)c1[CH+]c1ccc(o1)-c1cccc(c1)[N+]([O-])=O
Show InChI InChI=1S/C20H13N3O7/c24-18-16(19(25)22(20(26)21-18)11-15-5-2-8-29-15)10-14-6-7-17(30-14)12-3-1-4-13(9-12)23(27)28/h1-10H,11H2,(H-,21,24,25,26)
PCBioAssay
n/an/a 9.90E+3n/an/an/an/an/an/a
Emory University Molecular Libraries Screening Center
Curated by PubChem BioAssay
Assay Description
NIH Molecular Libraries Screening Centers Network [MLSCN] Emory Chemical Biology Discovery Center in MLSCN Assay provider: Theodore Jardetzky; Northw...
PubChem Bioassay (2008)
BindingDB Entry DOI: 10.7270/Q2057DCW
SUMO-conjugating enzyme UBC9
(Homo sapiens (Human))
BDBM50301
((5E)-1-(2-furanylmethyl)-5-[[5-(3-nitrophenyl)-2-f...)
Show SMILES [O-]c1[nH]c(=O)n(Cc2ccco2)c(=O)c1[CH+]c1ccc(o1)-c1cccc(c1)[N+]([O-])=O
Show InChI InChI=1S/C20H13N3O7/c24-18-16(19(25)22(20(26)21-18)11-15-5-2-8-29-15)10-14-6-7-17(30-14)12-3-1-4-13(9-12)23(27)28/h1-10H,11H2,(H-,21,24,25,26)
Reactome pathway
PCBioAssay
n/an/a 6.08E+3n/an/an/an/an/an/a
Burnham Center for Chemical Genomics
Curated by PubChem BioAssay
Assay Description
Data Source: Sanford-Burnham Center for Chemical Genomics (SBCCG) Source Affiliation: Sanford-Burnham Medical Research Institute (SBMRI, San Diego, C...
PubChem Bioassay (2010)
BindingDB Entry DOI: 10.7270/Q2V986G8
Bcl-2-like protein 1
(Homo sapiens (Human))
BDBM50301
((5E)-1-(2-furanylmethyl)-5-[[5-(3-nitrophenyl)-2-f...)
Show SMILES [O-]c1[nH]c(=O)n(Cc2ccco2)c(=O)c1[CH+]c1ccc(o1)-c1cccc(c1)[N+]([O-])=O
Show InChI InChI=1S/C20H13N3O7/c24-18-16(19(25)22(20(26)21-18)11-15-5-2-8-29-15)10-14-6-7-17(30-14)12-3-1-4-13(9-12)23(27)28/h1-10H,11H2,(H-,21,24,25,26)
NCI pathway
Reactome pathway
PCBioAssay
n/an/a 1.76E+4n/an/an/an/an/an/a
The Scripps Research Institute Molecular Screening Center
Curated by PubChem BioAssay
Assay Description
Source (MLPCN Center Name): The Scripps Research Institute Molecular Screening Center Affiliation: The Scripps Research Institute, TSRI Assay Provide...
PubChem Bioassay (2009)
BindingDB Entry DOI: 10.7270/Q2DF6PNW
60S ribosomal protein L19-A
(Saccharomyces cerevisiae)
BDBM50301
((5E)-1-(2-furanylmethyl)-5-[[5-(3-nitrophenyl)-2-f...)
Show SMILES [O-]c1[nH]c(=O)n(Cc2ccco2)c(=O)c1[CH+]c1ccc(o1)-c1cccc(c1)[N+]([O-])=O
Show InChI InChI=1S/C20H13N3O7/c24-18-16(19(25)22(20(26)21-18)11-15-5-2-8-29-15)10-14-6-7-17(30-14)12-3-1-4-13(9-12)23(27)28/h1-10H,11H2,(H-,21,24,25,26)
Reactome pathway
PCBioAssay
n/an/an/an/a 1.12E+4n/an/an/an/a
NMMLSC
Curated by PubChem BioAssay
Assay Description
University of New Mexico Assay Overview: Assay Support: 1R03 MH086450-01 Project Title: Chemical Screen of TOR pathway GFP fusion proteins in S. ...
PubChem Bioassay (2010)
BindingDB Entry DOI: 10.7270/Q2JQ0ZGP
Vacuolar aminopeptidase 1
(Saccharomyces cerevisiae)
BDBM50301
((5E)-1-(2-furanylmethyl)-5-[[5-(3-nitrophenyl)-2-f...)
Show SMILES [O-]c1[nH]c(=O)n(Cc2ccco2)c(=O)c1[CH+]c1ccc(o1)-c1cccc(c1)[N+]([O-])=O
Show InChI InChI=1S/C20H13N3O7/c24-18-16(19(25)22(20(26)21-18)11-15-5-2-8-29-15)10-14-6-7-17(30-14)12-3-1-4-13(9-12)23(27)28/h1-10H,11H2,(H-,21,24,25,26)
PCBioAssay
n/an/an/an/a 6.36E+3n/an/an/an/a
NMMLSC
Curated by PubChem BioAssay
Assay Description
University of New Mexico Assay Overview: Assay Support: 1R03 MH086450-01 Project Title: Chemical Screen of TOR pathway GFP fusion proteins in S. ...
PubChem Bioassay (2010)
BindingDB Entry DOI: 10.7270/Q21R6P02
Induced myeloid leukemia cell differentiation protein Mcl-1
(Homo sapiens (Human))
BDBM50301
((5E)-1-(2-furanylmethyl)-5-[[5-(3-nitrophenyl)-2-f...)
Show SMILES [O-]c1[nH]c(=O)n(Cc2ccco2)c(=O)c1[CH+]c1ccc(o1)-c1cccc(c1)[N+]([O-])=O
Show InChI InChI=1S/C20H13N3O7/c24-18-16(19(25)22(20(26)21-18)11-15-5-2-8-29-15)10-14-6-7-17(30-14)12-3-1-4-13(9-12)23(27)28/h1-10H,11H2,(H-,21,24,25,26)
NCI pathway
PCBioAssay
n/an/a 9.60E+3n/an/an/an/an/an/a
The Scripps Research Institute Molecular Screening Center
Curated by PubChem BioAssay
Assay Description
Source (MLPCN Center Name): The Scripps Research Institute Molecular Screening Center Affiliation: The Scripps Research Institute, TSRI Assay Provide...
PubChem Bioassay (2009)
BindingDB Entry DOI: 10.7270/Q2J67FCM
SUMO-activating enzyme subunit 1
(Homo sapiens (Human))
BDBM50301
((5E)-1-(2-furanylmethyl)-5-[[5-(3-nitrophenyl)-2-f...)
Show SMILES [O-]c1[nH]c(=O)n(Cc2ccco2)c(=O)c1[CH+]c1ccc(o1)-c1cccc(c1)[N+]([O-])=O
Show InChI InChI=1S/C20H13N3O7/c24-18-16(19(25)22(20(26)21-18)11-15-5-2-8-29-15)10-14-6-7-17(30-14)12-3-1-4-13(9-12)23(27)28/h1-10H,11H2,(H-,21,24,25,26)
Reactome pathway
PCBioAssay
n/an/a 2.25E+4n/an/an/an/an/an/a
Burnham Center for Chemical Genomics
Curated by PubChem BioAssay
Assay Description
Data Source: Sanford-Burnham Center for Chemical Genomics (SBCCG) Source Affiliation: Sanford-Burnham Medical Research Institute (SBMRI, San Diego, C...
PubChem Bioassay (2010)
BindingDB Entry DOI: 10.7270/Q2BP0175