null
SMILES: Fc1ccc(COc2ccn(-c3cccc(OCCN4CCCC4)c3)c(=O)c2)cc1
InChI Key: InChIKey=YAXYIJYIERUQSL-UHFFFAOYSA-N
Activity Spreadsheet -- Enzyme Inhibition Constant Data from BindingDB
Found 1 hit for monomerid = 50301082
Trg + Lig
Ki
nM
ΔG°
kcal/mole
IC50
nM
Kd
nM
EC50/IC50
nM
koff
s-1
kon
M-1s-1
pHTemp
°C
Melanin-concentrating hormone receptor 1
(Homo sapiens (Human))
BDBM50301082
(4-(4-fluorobenzyloxy)-1-(3-(2-(pyrrolidin-1-yl)eth...)
Show SMILES Fc1ccc(COc2ccn(-c3cccc(OCCN4CCCC4)c3)c(=O)c2)cc1
Show InChI InChI=1S/C24H25FN2O3/c25-20-8-6-19(7-9-20)18-30-23-10-13-27(24(28)17-23)21-4-3-5-22(16-21)29-15-14-26-11-1-2-12-26/h3-10,13,16-17H,1-2,11-12,14-15,18H2
Reactome pathway
n/an/a>1.00E+3n/an/an/an/an/an/a
Tsukuba Research Institute
Curated by ChEMBL
Assay Description
Antagonistic activity against MCH1R expressed on CHOK1 cells assessed as intracellular calcium mobilization by FLIPR
Bioorg Med Chem Lett 19: 5186-90 (2009)
Article DOI: 10.1016/j.bmcl.2009.07.023
BindingDB Entry DOI: 10.7270/Q2G44QCG