null
SMILES: CCCN(CCF)Cc1ccc(CCn2ccc(OCc3ccc(F)cc3)cc2=O)cc1
InChI Key: InChIKey=NFSDJUMTRUEHPP-UHFFFAOYSA-N
Activity Spreadsheet -- Enzyme Inhibition Constant Data from BindingDB
Found 1 hit for monomerid = 50301097
Trg + Lig
Ki
nM
ΔG°
kcal/mole
IC50
nM
Kd
nM
EC50/IC50
nM
koff
s-1
kon
M-1s-1
pHTemp
°C
Melanin-concentrating hormone receptor 1
(Homo sapiens (Human))
BDBM50301097
(4-(4-fluorobenzyloxy)-1-(4-(((2-fluoroethyl)(propy...)
Show SMILES CCCN(CCF)Cc1ccc(CCn2ccc(OCc3ccc(F)cc3)cc2=O)cc1
Show InChI InChI=1S/C26H30F2N2O2/c1-2-14-29(17-13-27)19-22-5-3-21(4-6-22)11-15-30-16-12-25(18-26(30)31)32-20-23-7-9-24(28)10-8-23/h3-10,12,16,18H,2,11,13-15,17,19-20H2,1H3
Reactome pathway
n/an/a 11n/an/an/an/an/an/a
Tsukuba Research Institute
Curated by ChEMBL
Assay Description
Antagonistic activity against MCH1R expressed on CHOK1 cells assessed as intracellular calcium mobilization by FLIPR
Bioorg Med Chem Lett 19: 5186-90 (2009)
Article DOI: 10.1016/j.bmcl.2009.07.023
BindingDB Entry DOI: 10.7270/Q2G44QCG