BDBM50301534 4-fluoro-N-methyl-N-(4-(pyrimidin-4-yl)thiazol-2-yl)benzamide::CHEMBL568991
SMILES: CN(C(=O)c1ccc(F)cc1)c1nc(cs1)-c1ccncn1
InChI Key: InChIKey=FPJGATLHQBZDSZ-UHFFFAOYSA-N
Data: 1 IC50
Activity Spreadsheet -- Enzyme Inhibition Constant Data from BindingDB
Found 1 hit for monomerid = 50301534
Trg + Lig
Ki
nM
ΔG°
kcal/mole
IC50
nM
Kd
nM
EC50/IC50
nM
koff
s-1
kon
M-1s-1
pHTemp
°C
Metabotropic glutamate receptor 1
(Homo sapiens (Human))
BDBM50301534
(4-fluoro-N-methyl-N-(4-(pyrimidin-4-yl)thiazol-2-y...)
Show SMILES CN(C(=O)c1ccc(F)cc1)c1nc(cs1)-c1ccncn1
Show InChI InChI=1S/C15H11FN4OS/c1-20(14(21)10-2-4-11(16)5-3-10)15-19-13(8-22-15)12-6-7-17-9-18-12/h2-9H,1H3
n/an/a 10n/an/an/an/an/an/a
Tsukuba Research Institute
Curated by ChEMBL
Assay Description
Antagonist activity at human mGluR1 receptor expressed in CHO cells by FLIPR assay
Bioorg Med Chem Lett 19: 5464-8 (2009)
Article DOI: 10.1016/j.bmcl.2009.07.097
BindingDB Entry DOI: 10.7270/Q2W66KTT