null
SMILES: C[C@H](Nc1nccc(n1)-n1cnc2cc(ccc12)-c1ccncc1)[C@@H]1CN(CCN1C)C(=O)Nc1cccc2ccccc12
InChI Key: InChIKey=JPBMZZADZDNNLM-FWUCURJTSA-N
Activity Spreadsheet -- Enzyme Inhibition Constant Data from BindingDB
Found 1 hit for monomerid = 50301624
Trg + Lig
Ki
nM
ΔG°
kcal/mole
IC50
nM
Kd
nM
EC50/IC50
nM
koff
s-1
kon
M-1s-1
pHTemp
°C
Tyrosine-protein kinase Lck
(Homo sapiens (Human))
BDBM50301624
((S)-4-methyl-N(S)-4-methyl-N-(naphthalen-1-yl)-3-(...)
Show SMILES C[C@H](Nc1nccc(n1)-n1cnc2cc(ccc12)-c1ccncc1)[C@@H]1CN(CCN1C)C(=O)Nc1cccc2ccccc12 |r|
Show InChI InChI=1S/C34H33N9O/c1-23(31-21-42(19-18-41(31)2)34(44)39-28-9-5-7-25-6-3-4-8-27(25)28)38-33-36-17-14-32(40-33)43-22-37-29-20-26(10-11-30(29)43)24-12-15-35-16-13-24/h3-17,20,22-23,31H,18-19,21H2,1-2H3,(H,39,44)(H,36,38,40)/t23-,31-/m0/s1
n/an/a 0.120n/an/an/an/an/an/a
Merck Research Laboratories
Curated by ChEMBL
Assay Description
Inhibition of Lck
Bioorg Med Chem Lett 19: 5440-3 (2009)
Article DOI: 10.1016/j.bmcl.2009.07.102
BindingDB Entry DOI: 10.7270/Q2GX4BM0