BDBM50301676 5-(3-((dimethylamino)methyl)phenyl)-4-(4-methyl-1H-indol-5-ylamino)nicotinonitrile::CHEMBL567930
SMILES: CN(C)Cc1cccc(c1)-c1cncc(C#N)c1Nc1ccc2[nH]ccc2c1C
InChI Key: InChIKey=GQDKNFXTRUBAEB-UHFFFAOYSA-N
Data: 2 IC50
Activity Spreadsheet -- Enzyme Inhibition Constant Data from BindingDB
Found 2 hits for monomerid = 50301676
Trg + Lig
Ki
nM
ΔG°
kcal/mole
IC50
nM
Kd
nM
EC50/IC50
nM
koff
s-1
kon
M-1s-1
pHTemp
°C
Protein kinase C delta type
(Homo sapiens (Human))
BDBM50301676
(5-(3-((dimethylamino)methyl)phenyl)-4-(4-methyl-1H...)
Show SMILES CN(C)Cc1cccc(c1)-c1cncc(C#N)c1Nc1ccc2[nH]ccc2c1C
Show InChI InChI=1S/C24H23N5/c1-16-20-9-10-27-23(20)8-7-22(16)28-24-19(12-25)13-26-14-21(24)18-6-4-5-17(11-18)15-29(2)3/h4-11,13-14,27H,15H2,1-3H3,(H,26,28)
NCI pathway
Reactome pathway
n/an/a 25n/an/an/an/an/an/a
Wyeth Research
Curated by ChEMBL
Assay Description
Inhibition of human PKCdelta by IMAP kinase assay
Bioorg Med Chem Lett 19: 5423-5 (2009)
Article DOI: 10.1016/j.bmcl.2009.07.109
BindingDB Entry DOI: 10.7270/Q2V69JPF
Protein kinase C theta type
(Homo sapiens (Human))
BDBM50301676
(5-(3-((dimethylamino)methyl)phenyl)-4-(4-methyl-1H...)
Show SMILES CN(C)Cc1cccc(c1)-c1cncc(C#N)c1Nc1ccc2[nH]ccc2c1C
Show InChI InChI=1S/C24H23N5/c1-16-20-9-10-27-23(20)8-7-22(16)28-24-19(12-25)13-26-14-21(24)18-6-4-5-17(11-18)15-29(2)3/h4-11,13-14,27H,15H2,1-3H3,(H,26,28)
NCI pathway
Reactome pathway
n/an/a 6.90n/an/an/an/an/an/a
Wyeth Research
Curated by ChEMBL
Assay Description
Inhibition of human PKCtheta by IMAP kinase assay
Bioorg Med Chem Lett 19: 5423-5 (2009)
Article DOI: 10.1016/j.bmcl.2009.07.109
BindingDB Entry DOI: 10.7270/Q2V69JPF