BDBM50301686 1-((5-(3-ethynyl-2-((4-methyl-1H-inden-5-yl)methyl)phenyl)furan-2-yl)methyl)-4-methylpiperazine::CHEMBL570865
SMILES: CN1CCN(Cc2ccc(o2)-c2cccc(C#C)c2Cc2ccc3CC=Cc3c2C)CC1
InChI Key: InChIKey=OLTHFAIHFDAJGG-UHFFFAOYSA-N
Data: 10 IC50
Activity Spreadsheet -- Enzyme Inhibition Constant Data from BindingDB
Found 10 hits for monomerid = 50301686
Trg + Lig
Ki
nM
ΔG°
kcal/mole
IC50
nM
Kd
nM
EC50/IC50
nM
koff
s-1
kon
M-1s-1
pHTemp
°C
Protein kinase C, eta
(Homo sapiens (Human))
BDBM50301686
(1-((5-(3-ethynyl-2-((4-methyl-1H-inden-5-yl)methyl...)
Show SMILES CN1CCN(Cc2ccc(o2)-c2cccc(C#C)c2Cc2ccc3CC=Cc3c2C)CC1 |c:27|
Show InChI InChI=1S/C29H30N2O/c1-4-22-7-5-10-27(28(22)19-24-12-11-23-8-6-9-26(23)21(24)2)29-14-13-25(32-29)20-31-17-15-30(3)16-18-31/h1,5-7,9-14H,8,15-20H2,2-3H3
NCI pathway
Reactome pathway
n/an/a 140n/an/an/an/an/an/a
Wyeth Research
Curated by ChEMBL
Assay Description
Inhibition of PKCeta by IMAP kinase assay
Bioorg Med Chem Lett 19: 5423-5 (2009)
Article DOI: 10.1016/j.bmcl.2009.07.109
BindingDB Entry DOI: 10.7270/Q2V69JPF
Protein kinase C theta type
(Homo sapiens (Human))
BDBM50301686
(1-((5-(3-ethynyl-2-((4-methyl-1H-inden-5-yl)methyl...)
Show SMILES CN1CCN(Cc2ccc(o2)-c2cccc(C#C)c2Cc2ccc3CC=Cc3c2C)CC1 |c:27|
Show InChI InChI=1S/C29H30N2O/c1-4-22-7-5-10-27(28(22)19-24-12-11-23-8-6-9-26(23)21(24)2)29-14-13-25(32-29)20-31-17-15-30(3)16-18-31/h1,5-7,9-14H,8,15-20H2,2-3H3
NCI pathway
Reactome pathway
n/an/a 4.5n/an/an/an/an/an/a
Wyeth Research
Curated by ChEMBL
Assay Description
Inhibition of human PKCtheta by IMAP kinase assay
Bioorg Med Chem Lett 19: 5423-5 (2009)
Article DOI: 10.1016/j.bmcl.2009.07.109
BindingDB Entry DOI: 10.7270/Q2V69JPF
Protein kinase C delta type
(Homo sapiens (Human))
BDBM50301686
(1-((5-(3-ethynyl-2-((4-methyl-1H-inden-5-yl)methyl...)
Show SMILES CN1CCN(Cc2ccc(o2)-c2cccc(C#C)c2Cc2ccc3CC=Cc3c2C)CC1 |c:27|
Show InChI InChI=1S/C29H30N2O/c1-4-22-7-5-10-27(28(22)19-24-12-11-23-8-6-9-26(23)21(24)2)29-14-13-25(32-29)20-31-17-15-30(3)16-18-31/h1,5-7,9-14H,8,15-20H2,2-3H3
NCI pathway
Reactome pathway
n/an/a 45n/an/an/an/an/an/a
Wyeth Research
Curated by ChEMBL
Assay Description
Inhibition of human PKCdelta by IMAP kinase assay
Bioorg Med Chem Lett 19: 5423-5 (2009)
Article DOI: 10.1016/j.bmcl.2009.07.109
BindingDB Entry DOI: 10.7270/Q2V69JPF
Protein kinase C, epsilon
(Homo sapiens (Human))
BDBM50301686
(1-((5-(3-ethynyl-2-((4-methyl-1H-inden-5-yl)methyl...)
Show SMILES CN1CCN(Cc2ccc(o2)-c2cccc(C#C)c2Cc2ccc3CC=Cc3c2C)CC1 |c:27|
Show InChI InChI=1S/C29H30N2O/c1-4-22-7-5-10-27(28(22)19-24-12-11-23-8-6-9-26(23)21(24)2)29-14-13-25(32-29)20-31-17-15-30(3)16-18-31/h1,5-7,9-14H,8,15-20H2,2-3H3
NCI pathway
Reactome pathway
n/an/a 12n/an/an/an/an/an/a
Wyeth Research
Curated by ChEMBL
Assay Description
Inhibition of PKCepsilon by IMAP kinase assay
Bioorg Med Chem Lett 19: 5423-5 (2009)
Article DOI: 10.1016/j.bmcl.2009.07.109
BindingDB Entry DOI: 10.7270/Q2V69JPF
Rho-associated protein kinase 1
(Homo sapiens (Human))
BDBM50301686
(1-((5-(3-ethynyl-2-((4-methyl-1H-inden-5-yl)methyl...)
Show SMILES CN1CCN(Cc2ccc(o2)-c2cccc(C#C)c2Cc2ccc3CC=Cc3c2C)CC1 |c:27|
Show InChI InChI=1S/C29H30N2O/c1-4-22-7-5-10-27(28(22)19-24-12-11-23-8-6-9-26(23)21(24)2)29-14-13-25(32-29)20-31-17-15-30(3)16-18-31/h1,5-7,9-14H,8,15-20H2,2-3H3
NCI pathway
Reactome pathway
n/an/a>5.00E+3n/an/an/an/an/an/a
Wyeth Research
Curated by ChEMBL
Assay Description
Inhibition of ROCK1
Bioorg Med Chem Lett 19: 5423-5 (2009)
Article DOI: 10.1016/j.bmcl.2009.07.109
BindingDB Entry DOI: 10.7270/Q2V69JPF
Protein kinase C (PKC)
(Homo sapiens (Human))
BDBM50301686
(1-((5-(3-ethynyl-2-((4-methyl-1H-inden-5-yl)methyl...)
Show SMILES CN1CCN(Cc2ccc(o2)-c2cccc(C#C)c2Cc2ccc3CC=Cc3c2C)CC1 |c:27|
Show InChI InChI=1S/C29H30N2O/c1-4-22-7-5-10-27(28(22)19-24-12-11-23-8-6-9-26(23)21(24)2)29-14-13-25(32-29)20-31-17-15-30(3)16-18-31/h1,5-7,9-14H,8,15-20H2,2-3H3
NCI pathway
Reactome pathway
n/an/a>1.00E+5n/an/an/an/an/an/a
Wyeth Research
Curated by ChEMBL
Assay Description
Inhibition of PKCzeta by IMAP kinase assay
Bioorg Med Chem Lett 19: 5423-5 (2009)
Article DOI: 10.1016/j.bmcl.2009.07.109
BindingDB Entry DOI: 10.7270/Q2V69JPF
Tyrosine-protein kinase Lck
(Homo sapiens (Human))
BDBM50301686
(1-((5-(3-ethynyl-2-((4-methyl-1H-inden-5-yl)methyl...)
Show SMILES CN1CCN(Cc2ccc(o2)-c2cccc(C#C)c2Cc2ccc3CC=Cc3c2C)CC1 |c:27|
Show InChI InChI=1S/C29H30N2O/c1-4-22-7-5-10-27(28(22)19-24-12-11-23-8-6-9-26(23)21(24)2)29-14-13-25(32-29)20-31-17-15-30(3)16-18-31/h1,5-7,9-14H,8,15-20H2,2-3H3
n/an/a>1.00E+3n/an/an/an/an/an/a
Wyeth Research
Curated by ChEMBL
Assay Description
Inhibition of Lck
Bioorg Med Chem Lett 19: 5423-5 (2009)
Article DOI: 10.1016/j.bmcl.2009.07.109
BindingDB Entry DOI: 10.7270/Q2V69JPF
Tyrosine-protein kinase Lyn
(Homo sapiens (Human))
BDBM50301686
(1-((5-(3-ethynyl-2-((4-methyl-1H-inden-5-yl)methyl...)
Show SMILES CN1CCN(Cc2ccc(o2)-c2cccc(C#C)c2Cc2ccc3CC=Cc3c2C)CC1 |c:27|
Show InChI InChI=1S/C29H30N2O/c1-4-22-7-5-10-27(28(22)19-24-12-11-23-8-6-9-26(23)21(24)2)29-14-13-25(32-29)20-31-17-15-30(3)16-18-31/h1,5-7,9-14H,8,15-20H2,2-3H3
Reactome pathway
n/an/a>5.00E+3n/an/an/an/an/an/a
Wyeth Research
Curated by ChEMBL
Assay Description
Inhibition of Lyn
Bioorg Med Chem Lett 19: 5423-5 (2009)
Article DOI: 10.1016/j.bmcl.2009.07.109
BindingDB Entry DOI: 10.7270/Q2V69JPF
MAP kinase-activated protein kinase 2
(Homo sapiens (Human))
BDBM50301686
(1-((5-(3-ethynyl-2-((4-methyl-1H-inden-5-yl)methyl...)
Show SMILES CN1CCN(Cc2ccc(o2)-c2cccc(C#C)c2Cc2ccc3CC=Cc3c2C)CC1 |c:27|
Show InChI InChI=1S/C29H30N2O/c1-4-22-7-5-10-27(28(22)19-24-12-11-23-8-6-9-26(23)21(24)2)29-14-13-25(32-29)20-31-17-15-30(3)16-18-31/h1,5-7,9-14H,8,15-20H2,2-3H3
NCI pathway
Reactome pathway
n/an/a>5.00E+3n/an/an/an/an/an/a
Wyeth Research
Curated by ChEMBL
Assay Description
Inhibition of MK2
Bioorg Med Chem Lett 19: 5423-5 (2009)
Article DOI: 10.1016/j.bmcl.2009.07.109
BindingDB Entry DOI: 10.7270/Q2V69JPF
PKC alpha and beta-2
(Homo sapiens (Human))
BDBM50301686
(1-((5-(3-ethynyl-2-((4-methyl-1H-inden-5-yl)methyl...)
Show SMILES CN1CCN(Cc2ccc(o2)-c2cccc(C#C)c2Cc2ccc3CC=Cc3c2C)CC1 |c:27|
Show InChI InChI=1S/C29H30N2O/c1-4-22-7-5-10-27(28(22)19-24-12-11-23-8-6-9-26(23)21(24)2)29-14-13-25(32-29)20-31-17-15-30(3)16-18-31/h1,5-7,9-14H,8,15-20H2,2-3H3
NCI pathway
Reactome pathway
n/an/a 2.50E+3n/an/an/an/an/an/a
Wyeth Research
Curated by ChEMBL
Assay Description
Inhibition of PKCbeta by IMAP kinase assay
Bioorg Med Chem Lett 19: 5423-5 (2009)
Article DOI: 10.1016/j.bmcl.2009.07.109
BindingDB Entry DOI: 10.7270/Q2V69JPF