BDBM50301688 4-(4-methyl-1H-indol-5-ylamino)-5-(5-(morpholinomethyl)furan-2-yl)nicotinonitrile::CHEMBL585858
SMILES: Cc1c(Nc2c(cncc2-c2ccc(CN3CCOCC3)o2)C#N)ccc2[nH]ccc12
InChI Key: InChIKey=VMRZSNDAPJYPND-UHFFFAOYSA-N
Data: 2 IC50
Activity Spreadsheet -- Enzyme Inhibition Constant Data from BindingDB
Found 2 hits for monomerid = 50301688
Trg + Lig
Ki
nM
ΔG°
kcal/mole
IC50
nM
Kd
nM
EC50/IC50
nM
koff
s-1
kon
M-1s-1
pHTemp
°C
Protein kinase C delta type
(Homo sapiens (Human))
BDBM50301688
(4-(4-methyl-1H-indol-5-ylamino)-5-(5-(morpholinome...)
Show SMILES Cc1c(Nc2c(cncc2-c2ccc(CN3CCOCC3)o2)C#N)ccc2[nH]ccc12
Show InChI InChI=1S/C24H23N5O2/c1-16-19-6-7-27-22(19)4-3-21(16)28-24-17(12-25)13-26-14-20(24)23-5-2-18(31-23)15-29-8-10-30-11-9-29/h2-7,13-14,27H,8-11,15H2,1H3,(H,26,28)
NCI pathway
Reactome pathway
n/an/a 86n/an/an/an/an/an/a
Wyeth Research
Curated by ChEMBL
Assay Description
Inhibition of human PKCdelta by IMAP kinase assay
Bioorg Med Chem Lett 19: 5423-5 (2009)
Article DOI: 10.1016/j.bmcl.2009.07.109
BindingDB Entry DOI: 10.7270/Q2V69JPF
Protein kinase C theta type
(Homo sapiens (Human))
BDBM50301688
(4-(4-methyl-1H-indol-5-ylamino)-5-(5-(morpholinome...)
Show SMILES Cc1c(Nc2c(cncc2-c2ccc(CN3CCOCC3)o2)C#N)ccc2[nH]ccc12
Show InChI InChI=1S/C24H23N5O2/c1-16-19-6-7-27-22(19)4-3-21(16)28-24-17(12-25)13-26-14-20(24)23-5-2-18(31-23)15-29-8-10-30-11-9-29/h2-7,13-14,27H,8-11,15H2,1H3,(H,26,28)
NCI pathway
Reactome pathway
n/an/a 7.80n/an/an/an/an/an/a
Wyeth Research
Curated by ChEMBL
Assay Description
Inhibition of human PKCtheta by IMAP kinase assay
Bioorg Med Chem Lett 19: 5423-5 (2009)
Article DOI: 10.1016/j.bmcl.2009.07.109
BindingDB Entry DOI: 10.7270/Q2V69JPF