null
SMILES: Fc1cc2COC3(CCN(Cc4ccc(cc4)C(=O)c4ccc(F)c(F)c4)CC3)c2cn1
InChI Key: InChIKey=RRZYXZCEHAPBIS-UHFFFAOYSA-N
Activity Spreadsheet -- Enzyme Inhibition Constant Data from BindingDB
Found 2 hits for monomerid = 50301701
Trg + Lig
Ki
nM
ΔG°
kcal/mole
IC50
nM
Kd
nM
EC50/IC50
nM
koff
s-1
kon
M-1s-1
pHTemp
°C
Potassium voltage-gated channel subfamily H member 2
(Homo sapiens (Human))
BDBM50301701
((3,4-difluorophenyl)(4-((6-fluoro-1H-spiro[furo[3,...)
Show SMILES Fc1cc2COC3(CCN(Cc4ccc(cc4)C(=O)c4ccc(F)c(F)c4)CC3)c2cn1
Show InChI InChI=1S/C25H21F3N2O2/c26-21-6-5-18(11-22(21)27)24(31)17-3-1-16(2-4-17)14-30-9-7-25(8-10-30)20-13-29-23(28)12-19(20)15-32-25/h1-6,11-13H,7-10,14-15H2
Reactome pathway
n/an/a 17n/an/an/an/an/an/a
Tsukuba Research Institute
Curated by ChEMBL
Assay Description
Displacement of [35S]MK-499 from human ERG expressed in HEK293 cells
Bioorg Med Chem Lett 19: 5339-45 (2009)
Article DOI: 10.1016/j.bmcl.2009.07.132
BindingDB Entry DOI: 10.7270/Q27P90BK
Melanin-concentrating hormone receptor 1
(Homo sapiens (Human))
BDBM50301701
((3,4-difluorophenyl)(4-((6-fluoro-1H-spiro[furo[3,...)
Show SMILES Fc1cc2COC3(CCN(Cc4ccc(cc4)C(=O)c4ccc(F)c(F)c4)CC3)c2cn1
Show InChI InChI=1S/C25H21F3N2O2/c26-21-6-5-18(11-22(21)27)24(31)17-3-1-16(2-4-17)14-30-9-7-25(8-10-30)20-13-29-23(28)12-19(20)15-32-25/h1-6,11-13H,7-10,14-15H2
Reactome pathway
n/an/a 1.40n/an/an/an/an/an/a
Tsukuba Research Institute
Curated by ChEMBL
Assay Description
Displacement of [125I]MCH from human MCH1R expressed in CHO cells
Bioorg Med Chem Lett 19: 5339-45 (2009)
Article DOI: 10.1016/j.bmcl.2009.07.132
BindingDB Entry DOI: 10.7270/Q27P90BK