null
SMILES: C[C@@H]1CNCCN1c1cc(=O)n(C)c(CCc2ccccc2C)n1
InChI Key: InChIKey=PIROQQYURKLFAS-OAHLLOKOSA-N
Activity Spreadsheet -- Enzyme Inhibition Constant Data from BindingDB
Found 1 hit for monomerid = 50301786
Trg + Lig
Ki
nM
ΔG°
kcal/mole
IC50
nM
Kd
nM
EC50/IC50
nM
koff
s-1
kon
M-1s-1
pHTemp
°C
5-hydroxytryptamine receptor 2C
(Homo sapiens (Human))
BDBM50301786
((R)-3-methyl-2-(2-methylphenethyl)-6-(2-methylpipe...)
Show SMILES C[C@@H]1CNCCN1c1cc(=O)n(C)c(CCc2ccccc2C)n1 |r|
Show InChI InChI=1S/C19H26N4O/c1-14-6-4-5-7-16(14)8-9-17-21-18(12-19(24)22(17)3)23-11-10-20-13-15(23)2/h4-7,12,15,20H,8-11,13H2,1-3H3/t15-/m1/s1
Reactome pathway
n/an/an/an/a 26n/an/an/an/a
Pfizer Global Research and Development
Curated by ChEMBL
Assay Description
Agonist activity at human recombinant 5HT2C receptor expressed in CHO K1 cells assessed as calcium mobilisation by FLIPR assay
Bioorg Med Chem Lett 19: 5346-50 (2009)
Article DOI: 10.1016/j.bmcl.2009.07.133
BindingDB Entry DOI: 10.7270/Q2B56JT3