BDBM50301823 5-(1-(2-fluoropyridin-3-yl)-5-methyl-1H-1,2,3-triazol-4-yl)-2-isopropylisoindolin-1-one::CHEMBL584478
SMILES: CC(C)N1Cc2cc(ccc2C1=O)-c1nnn(c1C)-c1cccnc1F
InChI Key: InChIKey=ZUWMBBZBDLJVHD-UHFFFAOYSA-N
Data: 2 IC50
Activity Spreadsheet -- Enzyme Inhibition Constant Data from BindingDB
Found 2 hits for monomerid = 50301823
Trg + Lig
Ki
nM
ΔG°
kcal/mole
IC50
nM
Kd
nM
EC50/IC50
nM
koff
s-1
kon
M-1s-1
pHTemp
°C
Metabotropic glutamate receptor 5
(Homo sapiens (Human))
BDBM50301823
(5-(1-(2-fluoropyridin-3-yl)-5-methyl-1H-1,2,3-tria...)
Show SMILES CC(C)N1Cc2cc(ccc2C1=O)-c1nnn(c1C)-c1cccnc1F
Show InChI InChI=1S/C19H18FN5O/c1-11(2)24-10-14-9-13(6-7-15(14)19(24)26)17-12(3)25(23-22-17)16-5-4-8-21-18(16)20/h4-9,11H,10H2,1-3H3
n/an/a 2.30E+3n/an/an/an/an/an/a
Tsukuba Research Institute
Curated by ChEMBL
Assay Description
Antagonist activity at human mGluR5 receptor expressed in CHO cell membranes assessed as inhibition of L-glutamate-induced calcium mobilization by FL...
Bioorg Med Chem Lett 19: 5310-3 (2009)
Article DOI: 10.1016/j.bmcl.2009.07.145
BindingDB Entry DOI: 10.7270/Q26H4HGN
Metabotropic glutamate receptor 1
(Homo sapiens (Human))
BDBM50301823
(5-(1-(2-fluoropyridin-3-yl)-5-methyl-1H-1,2,3-tria...)
Show SMILES CC(C)N1Cc2cc(ccc2C1=O)-c1nnn(c1C)-c1cccnc1F
Show InChI InChI=1S/C19H18FN5O/c1-11(2)24-10-14-9-13(6-7-15(14)19(24)26)17-12(3)25(23-22-17)16-5-4-8-21-18(16)20/h4-9,11H,10H2,1-3H3
n/an/a 5.5n/an/an/an/an/an/a
Tsukuba Research Institute
Curated by ChEMBL
Assay Description
Antagonist activity at human mGluR1 receptor expressed in CHO cell membranes assessed as inhibition of L-glutamate-induced calcium mobilization by FL...
Bioorg Med Chem Lett 19: 5310-3 (2009)
Article DOI: 10.1016/j.bmcl.2009.07.145
BindingDB Entry DOI: 10.7270/Q26H4HGN