BDBM50301824 2-cyclopropyl-5-(1-(2-fluoropyridin-3-yl)-5-methyl-1H-1,2,3-triazol-4-yl)isoindolin-1-one::CHEMBL578995
SMILES: Cc1c(nnn1-c1cccnc1F)-c1ccc2C(=O)N(Cc2c1)C1CC1
InChI Key: InChIKey=XZBFQWRAIYRPPZ-UHFFFAOYSA-N
Data: 2 IC50
Activity Spreadsheet -- Enzyme Inhibition Constant Data from BindingDB
Found 2 hits for monomerid = 50301824
Trg + Lig
Ki
nM
ΔG°
kcal/mole
IC50
nM
Kd
nM
EC50/IC50
nM
koff
s-1
kon
M-1s-1
pHTemp
°C
Metabotropic glutamate receptor 5
(Homo sapiens (Human))
BDBM50301824
(2-cyclopropyl-5-(1-(2-fluoropyridin-3-yl)-5-methyl...)
Show SMILES Cc1c(nnn1-c1cccnc1F)-c1ccc2C(=O)N(Cc2c1)C1CC1
Show InChI InChI=1S/C19H16FN5O/c1-11-17(22-23-25(11)16-3-2-8-21-18(16)20)12-4-7-15-13(9-12)10-24(19(15)26)14-5-6-14/h2-4,7-9,14H,5-6,10H2,1H3
n/an/a 5.40E+3n/an/an/an/an/an/a
Tsukuba Research Institute
Curated by ChEMBL
Assay Description
Antagonist activity at human mGluR5 receptor expressed in CHO cell membranes assessed as inhibition of L-glutamate-induced calcium mobilization by FL...
Bioorg Med Chem Lett 19: 5310-3 (2009)
Article DOI: 10.1016/j.bmcl.2009.07.145
BindingDB Entry DOI: 10.7270/Q26H4HGN
Metabotropic glutamate receptor 1
(Homo sapiens (Human))
BDBM50301824
(2-cyclopropyl-5-(1-(2-fluoropyridin-3-yl)-5-methyl...)
Show SMILES Cc1c(nnn1-c1cccnc1F)-c1ccc2C(=O)N(Cc2c1)C1CC1
Show InChI InChI=1S/C19H16FN5O/c1-11-17(22-23-25(11)16-3-2-8-21-18(16)20)12-4-7-15-13(9-12)10-24(19(15)26)14-5-6-14/h2-4,7-9,14H,5-6,10H2,1H3
n/an/a 3.5n/an/an/an/an/an/a
Tsukuba Research Institute
Curated by ChEMBL
Assay Description
Antagonist activity at human mGluR1 receptor expressed in CHO cell membranes assessed as inhibition of L-glutamate-induced calcium mobilization by FL...
Bioorg Med Chem Lett 19: 5310-3 (2009)
Article DOI: 10.1016/j.bmcl.2009.07.145
BindingDB Entry DOI: 10.7270/Q26H4HGN