BDBM50301916 CHEMBL585715::N-{3-[(S)-5-tert-Butyl-1-(4-fluoro-benzyl)-4-hydroxy-2-oxo-2,5-dihydro-1H-pyrrol-3-yl]-5-fluoro-1,1-dioxo-1,4-dihydro-1lambda*6*-benzo[1,4]thiazin-7-yl}-methanesulfonamide
SMILES: CC(C)(C)[C@@H]1N(Cc2ccc(F)cc2)C(=O)C(C1=O)C1=Nc2c(F)cc(NS(C)(=O)=O)cc2S(=O)(=O)C1
InChI Key: InChIKey=MVZLDNHIZYSRNI-AVKWCDSFSA-N
Data: 1 IC50
Activity Spreadsheet -- Enzyme Inhibition Constant Data from BindingDB
Found 1 hit for monomerid = 50301916
Trg + Lig
Ki
nM
ΔG°
kcal/mole
IC50
nM
Kd
nM
EC50/IC50
nM
koff
s-1
kon
M-1s-1
pHTemp
°C
RNA polymerase (NS5B)
(Hepatitis C virus (HCV))
BDBM50301916
(CHEMBL585715 | N-{3-[(S)-5-tert-Butyl-1-(4-fluoro-...)
Show SMILES CC(C)(C)[C@@H]1N(Cc2ccc(F)cc2)C(=O)C(C1=O)C1=Nc2c(F)cc(NS(C)(=O)=O)cc2S(=O)(=O)C1 |r,t:21|
Show InChI InChI=1S/C24H25F2N3O6S2/c1-24(2,3)22-21(30)19(23(31)29(22)11-13-5-7-14(25)8-6-13)17-12-37(34,35)18-10-15(28-36(4,32)33)9-16(26)20(18)27-17/h5-10,19,22,28H,11-12H2,1-4H3/t19?,22-/m1/s1
n/an/a 9n/an/an/an/an/an/a
Roche Palo Alto LLC
Curated by ChEMBL
Assay Description
Inhibition of HSV 1b con1 NS5B polymerase assessed as [3H]UTP incorporation into acid insoluble RNA product
Bioorg Med Chem Lett 19: 5648-51 (2009)
Article DOI: 10.1016/j.bmcl.2009.08.023
BindingDB Entry DOI: 10.7270/Q2T72HJM