BDBM50302151 (S)-2-(1-(2-chlorophenoxy)propan-2-yl)-6-(piperazin-1-yl)pyridazin-3(2H)-one::CHEMBL572252
SMILES: C[C@@H](COc1ccccc1Cl)n1nc(ccc1=O)N1CCNCC1
InChI Key: InChIKey=CANDRMATFQVMGD-ZDUSSCGKSA-N
Data: 1 KI  3 EC50
Activity Spreadsheet -- Enzyme Inhibition Constant Data from BindingDB
Found 4 hits for monomerid = 50302151
Trg + Lig
Ki
nM
ΔG°
kcal/mole
IC50
nM
Kd
nM
EC50/IC50
nM
koff
s-1
kon
M-1s-1
pHTemp
°C
5-hydroxytryptamine receptor 2C
(Homo sapiens (Human))
BDBM50302151
((S)-2-(1-(2-chlorophenoxy)propan-2-yl)-6-(piperazi...)
Show SMILES C[C@@H](COc1ccccc1Cl)n1nc(ccc1=O)N1CCNCC1 |r|
Show InChI InChI=1S/C17H21ClN4O2/c1-13(12-24-15-5-3-2-4-14(15)18)22-17(23)7-6-16(20-22)21-10-8-19-9-11-21/h2-7,13,19H,8-12H2,1H3/t13-/m0/s1
Reactome pathway
728n/an/an/an/an/an/an/an/a
Pfizer Global Research and Development
Curated by ChEMBL
Assay Description
Displacement of [3H]meselurgine from human recombinant 5HT2C receptor expressed in Swiss mouse 3T3 cells by SPA
Bioorg Med Chem Lett 19: 5791-5 (2009)
Article DOI: 10.1016/j.bmcl.2009.07.136
BindingDB Entry DOI: 10.7270/Q2X0674Z
5-hydroxytryptamine receptor 2B
(Homo sapiens (Human))
BDBM50302151
((S)-2-(1-(2-chlorophenoxy)propan-2-yl)-6-(piperazi...)
Show SMILES C[C@@H](COc1ccccc1Cl)n1nc(ccc1=O)N1CCNCC1 |r|
Show InChI InChI=1S/C17H21ClN4O2/c1-13(12-24-15-5-3-2-4-14(15)18)22-17(23)7-6-16(20-22)21-10-8-19-9-11-21/h2-7,13,19H,8-12H2,1H3/t13-/m0/s1
Reactome pathway
n/an/an/an/a 506n/an/an/an/a
Pfizer Global Research and Development
Curated by ChEMBL
Assay Description
Agonist activity at human recombinant 5HT2B receptor expressed in Swiss mouse 3T3 cells assessed as induction of calcium mobilization by FLIPR assay
Bioorg Med Chem Lett 19: 5791-5 (2009)
Article DOI: 10.1016/j.bmcl.2009.07.136
BindingDB Entry DOI: 10.7270/Q2X0674Z
5-hydroxytryptamine receptor 2C
(Homo sapiens (Human))
BDBM50302151
((S)-2-(1-(2-chlorophenoxy)propan-2-yl)-6-(piperazi...)
Show SMILES C[C@@H](COc1ccccc1Cl)n1nc(ccc1=O)N1CCNCC1 |r|
Show InChI InChI=1S/C17H21ClN4O2/c1-13(12-24-15-5-3-2-4-14(15)18)22-17(23)7-6-16(20-22)21-10-8-19-9-11-21/h2-7,13,19H,8-12H2,1H3/t13-/m0/s1
Reactome pathway
n/an/an/an/a 25n/an/an/an/a
Pfizer Global Research and Development
Curated by ChEMBL
Assay Description
Agonist activity at human recombinant 5HT2C receptor expressed in CHOK1 cells assessed as induction of calcium mobilization by FLIPR assay
Bioorg Med Chem Lett 19: 5791-5 (2009)
Article DOI: 10.1016/j.bmcl.2009.07.136
BindingDB Entry DOI: 10.7270/Q2X0674Z
5-hydroxytryptamine receptor 2A
(Homo sapiens (Human))
BDBM50302151
((S)-2-(1-(2-chlorophenoxy)propan-2-yl)-6-(piperazi...)
Show SMILES C[C@@H](COc1ccccc1Cl)n1nc(ccc1=O)N1CCNCC1 |r|
Show InChI InChI=1S/C17H21ClN4O2/c1-13(12-24-15-5-3-2-4-14(15)18)22-17(23)7-6-16(20-22)21-10-8-19-9-11-21/h2-7,13,19H,8-12H2,1H3/t13-/m0/s1
Reactome pathway
n/an/an/an/a 65n/an/an/an/a
Pfizer Global Research and Development
Curated by ChEMBL
Assay Description
Agonist activity at human recombinant 5HT2A receptor expressed in Swiss mouse 3T3 cells assessed as induction of calcium mobilization by FLIPR assay
Bioorg Med Chem Lett 19: 5791-5 (2009)
Article DOI: 10.1016/j.bmcl.2009.07.136
BindingDB Entry DOI: 10.7270/Q2X0674Z