BDBM50302169 3-amino-6-(1,4-diazepan-1-yl)-4-propylthieno[2,3-b]pyridine-2-carboxamide::CHEMBL565347
SMILES: CCCc1cc(nc2sc(C(N)=O)c(N)c12)N1CCCNCC1
InChI Key: InChIKey=DYCNTFOXYSCURR-UHFFFAOYSA-N
Data: 1 IC50
Activity Spreadsheet -- Enzyme Inhibition Constant Data from BindingDB
Found 1 hit for monomerid = 50302169
Trg + Lig
Ki
nM
ΔG°
kcal/mole
IC50
nM
Kd
nM
EC50/IC50
nM
koff
s-1
kon
M-1s-1
pHTemp
°C
Inhibitor of nuclear factor kappa-B kinase subunit beta
(Homo sapiens (Human))
BDBM50302169
(3-amino-6-(1,4-diazepan-1-yl)-4-propylthieno[2,3-b...)
Show SMILES CCCc1cc(nc2sc(C(N)=O)c(N)c12)N1CCCNCC1
Show InChI InChI=1S/C16H23N5OS/c1-2-4-10-9-11(21-7-3-5-19-6-8-21)20-16-12(10)13(17)14(23-16)15(18)22/h9,19H,2-8,17H2,1H3,(H2,18,22)
NCI pathway
Reactome pathway
n/an/a 72n/an/an/an/an/an/a
Boehringer Ingelheim Pharmaceuticals
Curated by ChEMBL
Assay Description
Inhibition of Flag epitope-tagged IKK-beta preincubated for 5 mins by scintillation proximity assay
Bioorg Med Chem Lett 19: 5547-51 (2009)
Article DOI: 10.1016/j.bmcl.2009.08.054
BindingDB Entry DOI: 10.7270/Q22Z16G1