BDBM50302175 3-amino-6-(4-(methylsulfonamido)piperidin-1-yl)-4-propylthieno[2,3-b]pyridine-2-carboxamide::CHEMBL570276
SMILES: CCCc1cc(nc2sc(C(N)=O)c(N)c12)N1CCC(CC1)NS(C)(=O)=O
InChI Key: InChIKey=CREAHTMWKXOTPH-UHFFFAOYSA-N
Data: 1 IC50
Activity Spreadsheet -- Enzyme Inhibition Constant Data from BindingDB
Found 1 hit for monomerid = 50302175
Trg + Lig
Ki
nM
ΔG°
kcal/mole
IC50
nM
Kd
nM
EC50/IC50
nM
koff
s-1
kon
M-1s-1
pHTemp
°C
Inhibitor of nuclear factor kappa-B kinase subunit beta
(Homo sapiens (Human))
BDBM50302175
(3-amino-6-(4-(methylsulfonamido)piperidin-1-yl)-4-...)
Show SMILES CCCc1cc(nc2sc(C(N)=O)c(N)c12)N1CCC(CC1)NS(C)(=O)=O
Show InChI InChI=1S/C17H25N5O3S2/c1-3-4-10-9-12(20-17-13(10)14(18)15(26-17)16(19)23)22-7-5-11(6-8-22)21-27(2,24)25/h9,11,21H,3-8,18H2,1-2H3,(H2,19,23)
NCI pathway
Reactome pathway
n/an/a 98n/an/an/an/an/an/a
Boehringer Ingelheim Pharmaceuticals
Curated by ChEMBL
Assay Description
Inhibition of Flag epitope-tagged IKK-beta preincubated for 5 mins by scintillation proximity assay
Bioorg Med Chem Lett 19: 5547-51 (2009)
Article DOI: 10.1016/j.bmcl.2009.08.054
BindingDB Entry DOI: 10.7270/Q22Z16G1