BDBM50302178 3-amino-6-(4-carbamoylpiperidin-1-yl)-4-propylthieno[2,3-b]pyridine-2-carboxamide::CHEMBL569814
SMILES: CCCc1cc(nc2sc(C(N)=O)c(N)c12)N1CCC(CC1)C(N)=O
InChI Key: InChIKey=MCCFRAKLOFHVJQ-UHFFFAOYSA-N
Data: 1 IC50
Activity Spreadsheet -- Enzyme Inhibition Constant Data from BindingDB
Found 1 hit for monomerid = 50302178
Trg + Lig
Ki
nM
ΔG°
kcal/mole
IC50
nM
Kd
nM
EC50/IC50
nM
koff
s-1
kon
M-1s-1
pHTemp
°C
Inhibitor of nuclear factor kappa-B kinase subunit beta
(Homo sapiens (Human))
BDBM50302178
(3-amino-6-(4-carbamoylpiperidin-1-yl)-4-propylthie...)
Show SMILES CCCc1cc(nc2sc(C(N)=O)c(N)c12)N1CCC(CC1)C(N)=O
Show InChI InChI=1S/C17H23N5O2S/c1-2-3-10-8-11(22-6-4-9(5-7-22)15(19)23)21-17-12(10)13(18)14(25-17)16(20)24/h8-9H,2-7,18H2,1H3,(H2,19,23)(H2,20,24)
NCI pathway
Reactome pathway
n/an/a 1.30E+3n/an/an/an/an/an/a
Boehringer Ingelheim Pharmaceuticals
Curated by ChEMBL
Assay Description
Inhibition of Flag epitope-tagged IKK-beta preincubated for 5 mins by scintillation proximity assay
Bioorg Med Chem Lett 19: 5547-51 (2009)
Article DOI: 10.1016/j.bmcl.2009.08.054
BindingDB Entry DOI: 10.7270/Q22Z16G1