BDBM50302208 3-amino-6-methyl-4-propylthieno[2,3-b]pyridine-2-carboxamide::CHEMBL570046
SMILES: CCCc1cc(C)nc2sc(C(N)=O)c(N)c12
InChI Key: InChIKey=DBJFACCSLIVTRL-UHFFFAOYSA-N
Data: 1 IC50
Activity Spreadsheet -- Enzyme Inhibition Constant Data from BindingDB
Found 1 hit for monomerid = 50302208
Trg + Lig
Ki
nM
ΔG°
kcal/mole
IC50
nM
Kd
nM
EC50/IC50
nM
koff
s-1
kon
M-1s-1
pHTemp
°C
Inhibitor of nuclear factor kappa-B kinase subunit beta
(Homo sapiens (Human))
BDBM50302208
(3-amino-6-methyl-4-propylthieno[2,3-b]pyridine-2-c...)
Show SMILES CCCc1cc(C)nc2sc(C(N)=O)c(N)c12
Show InChI InChI=1S/C12H15N3OS/c1-3-4-7-5-6(2)15-12-8(7)9(13)10(17-12)11(14)16/h5H,3-4,13H2,1-2H3,(H2,14,16)
NCI pathway
Reactome pathway
n/an/a 1.30E+3n/an/an/an/an/an/a
Boehringer Ingelheim Pharmaceuticals
Curated by ChEMBL
Assay Description
Inhibition of Flag epitope-tagged IKK-beta preincubated for 5 mins by scintillation proximity assay
Bioorg Med Chem Lett 19: 5547-51 (2009)
Article DOI: 10.1016/j.bmcl.2009.08.054
BindingDB Entry DOI: 10.7270/Q22Z16G1