BDBM50302416 2-(6-chloro-9-(4-(methylsulfonyl)phenyl)-1H-phenanthro[9,10-d]imidazol-2-yl)isophthalonitrile::CHEMBL585295
SMILES: CS(=O)(=O)c1ccc(cc1)-c1ccc2c3[nH]c(nc3c3ccc(Cl)cc3c2c1)-c1c(cccc1C#N)C#N
InChI Key: InChIKey=JZLICPAMRXXVHH-UHFFFAOYSA-N
Data: 2 IC50
Activity Spreadsheet -- Enzyme Inhibition Constant Data from BindingDB
Found 2 hits for monomerid = 50302416
Trg + Lig
Ki
nM
ΔG°
kcal/mole
IC50
nM
Kd
nM
EC50/IC50
nM
koff
s-1
kon
M-1s-1
pHTemp
°C
Prostaglandin E synthase
(Homo sapiens (Human))
BDBM50302416
(2-(6-chloro-9-(4-(methylsulfonyl)phenyl)-1H-phenan...)
Show SMILES CS(=O)(=O)c1ccc(cc1)-c1ccc2c3[nH]c(nc3c3ccc(Cl)cc3c2c1)-c1c(cccc1C#N)C#N
Show InChI InChI=1S/C30H17ClN4O2S/c1-38(36,37)22-9-5-17(6-10-22)18-7-11-23-25(13-18)26-14-21(31)8-12-24(26)29-28(23)34-30(35-29)27-19(15-32)3-2-4-20(27)16-33/h2-14H,1H3,(H,34,35)
Reactome pathway
n/an/a 2n/an/an/an/an/an/a
Merck Frosst Centre for Therapeutic Research
Curated by ChEMBL
Assay Description
Displacement of [3H]PGH2 from human recombinant PGES1 expressed in CHOK1 cells
Bioorg Med Chem Lett 19: 5837-41 (2009)
Article DOI: 10.1016/j.bmcl.2009.08.085
BindingDB Entry DOI: 10.7270/Q2MG7PKK
Prostaglandin E synthase
(Homo sapiens (Human))
BDBM50302416
(2-(6-chloro-9-(4-(methylsulfonyl)phenyl)-1H-phenan...)
Show SMILES CS(=O)(=O)c1ccc(cc1)-c1ccc2c3[nH]c(nc3c3ccc(Cl)cc3c2c1)-c1c(cccc1C#N)C#N
Show InChI InChI=1S/C30H17ClN4O2S/c1-38(36,37)22-9-5-17(6-10-22)18-7-11-23-25(13-18)26-14-21(31)8-12-24(26)29-28(23)34-30(35-29)27-19(15-32)3-2-4-20(27)16-33/h2-14H,1H3,(H,34,35)
Reactome pathway
n/an/a 45n/an/an/an/an/an/a
Merck Frosst Centre for Therapeutic Research
Curated by ChEMBL
Assay Description
Inhibition of mPGES1 in IL-1beta-stimulated human A549 cells assessed as blockade of PGH2 to PGE2 conversion in presence of 50% fetal bovine serum
Bioorg Med Chem Lett 19: 5837-41 (2009)
Article DOI: 10.1016/j.bmcl.2009.08.085
BindingDB Entry DOI: 10.7270/Q2MG7PKK