BDBM50302475 CHEMBL567491::N-(3,3-diphenylpropyl)-1-(2-ethoxyethyl)-6-oxo-1,6-dihydropyridine-3-carboxamide
SMILES: CCOCCn1cc(ccc1=O)C(=O)NCCC(c1ccccc1)c1ccccc1
InChI Key: InChIKey=FRFOVMCWEGGFDM-UHFFFAOYSA-N
Data: 2 IC50
Activity Spreadsheet -- Enzyme Inhibition Constant Data from BindingDB
Found 2 hits for monomerid = 50302475
Trg + Lig
Ki
nM
ΔG°
kcal/mole
IC50
nM
Kd
nM
EC50/IC50
nM
koff
s-1
kon
M-1s-1
pHTemp
°C
EBifunctional epoxide hydrolase 2
(Homo sapiens (Human))
BDBM50302475
(CHEMBL567491 | N-(3,3-diphenylpropyl)-1-(2-ethoxye...)
Show SMILES CCOCCn1cc(ccc1=O)C(=O)NCCC(c1ccccc1)c1ccccc1
Show InChI InChI=1S/C25H28N2O3/c1-2-30-18-17-27-19-22(13-14-24(27)28)25(29)26-16-15-23(20-9-5-3-6-10-20)21-11-7-4-8-12-21/h3-14,19,23H,2,15-18H2,1H3,(H,26,29)
n/an/a 2.60n/an/an/an/an/an/a
Boehringer Ingelheim Pharmaceuticals
Curated by ChEMBL
Assay Description
Inhibition of human soluble EH
Bioorg Med Chem Lett 19: 5864-8 (2009)
Article DOI: 10.1016/j.bmcl.2009.08.074
BindingDB Entry DOI: 10.7270/Q27944SC
Epoxide hydrolase 2
(Rattus norvegicus)
BDBM50302475
(CHEMBL567491 | N-(3,3-diphenylpropyl)-1-(2-ethoxye...)
Show SMILES CCOCCn1cc(ccc1=O)C(=O)NCCC(c1ccccc1)c1ccccc1
Show InChI InChI=1S/C25H28N2O3/c1-2-30-18-17-27-19-22(13-14-24(27)28)25(29)26-16-15-23(20-9-5-3-6-10-20)21-11-7-4-8-12-21/h3-14,19,23H,2,15-18H2,1H3,(H,26,29)
n/an/a 4n/an/an/an/an/an/a
Boehringer Ingelheim Pharmaceuticals
Curated by ChEMBL
Assay Description
Inhibition of rat sEH
Bioorg Med Chem Lett 19: 5864-8 (2009)
Article DOI: 10.1016/j.bmcl.2009.08.074
BindingDB Entry DOI: 10.7270/Q27944SC