BDBM50302514 4-(2-methyl-1H-indol-5-ylamino)-5-styrylnicotinonitrile::CHEMBL569203
SMILES: Cc1cc2cc(Nc3c(\C=C\c4ccccc4)cncc3C#N)ccc2[nH]1
InChI Key: InChIKey=CLGKERUQODCNJI-BQYQJAHWSA-N
Data: 2 IC50
Activity Spreadsheet -- Enzyme Inhibition Constant Data from BindingDB
Found 2 hits for monomerid = 50302514
Trg + Lig
Ki
nM
ΔG°
kcal/mole
IC50
nM
Kd
nM
EC50/IC50
nM
koff
s-1
kon
M-1s-1
pHTemp
°C
Protein kinase C delta type
(Homo sapiens (Human))
BDBM50302514
(4-(2-methyl-1H-indol-5-ylamino)-5-styrylnicotinoni...)
Show SMILES Cc1cc2cc(Nc3c(\C=C\c4ccccc4)cncc3C#N)ccc2[nH]1
Show InChI InChI=1S/C23H18N4/c1-16-11-19-12-21(9-10-22(19)26-16)27-23-18(14-25-15-20(23)13-24)8-7-17-5-3-2-4-6-17/h2-12,14-15,26H,1H3,(H,25,27)/b8-7+
NCI pathway
Reactome pathway
n/an/a 800n/an/an/an/an/an/a
Wyeth Research
Curated by ChEMBL
Assay Description
Inhibition of PKCdelta by IMAP kinase assay
Bioorg Med Chem Lett 19: 5829-32 (2009)
Article DOI: 10.1016/j.bmcl.2009.08.086
BindingDB Entry DOI: 10.7270/Q2ZS2WKC
Protein kinase C theta type
(Homo sapiens (Human))
BDBM50302514
(4-(2-methyl-1H-indol-5-ylamino)-5-styrylnicotinoni...)
Show SMILES Cc1cc2cc(Nc3c(\C=C\c4ccccc4)cncc3C#N)ccc2[nH]1
Show InChI InChI=1S/C23H18N4/c1-16-11-19-12-21(9-10-22(19)26-16)27-23-18(14-25-15-20(23)13-24)8-7-17-5-3-2-4-6-17/h2-12,14-15,26H,1H3,(H,25,27)/b8-7+
NCI pathway
Reactome pathway
n/an/a 360n/an/an/an/an/an/a
Wyeth Research
Curated by ChEMBL
Assay Description
Inhibition of human PKCtheta by IMAP kinase assay
Bioorg Med Chem Lett 19: 5829-32 (2009)
Article DOI: 10.1016/j.bmcl.2009.08.086
BindingDB Entry DOI: 10.7270/Q2ZS2WKC