BDBM50302525 5-(2-methoxystyryl)-4-(4-methyl-1H-indol-5-ylamino)nicotinonitrile::CHEMBL568407
SMILES: COc1ccccc1\C=C\c1cncc(C#N)c1Nc1ccc2[nH]ccc2c1C
InChI Key: InChIKey=DQGXZJOMYLWAKM-BQYQJAHWSA-N
Data: 2 IC50
Activity Spreadsheet -- Enzyme Inhibition Constant Data from BindingDB
Found 2 hits for monomerid = 50302525
Trg + Lig
Ki
nM
ΔG°
kcal/mole
IC50
nM
Kd
nM
EC50/IC50
nM
koff
s-1
kon
M-1s-1
pHTemp
°C
Protein kinase C delta type
(Homo sapiens (Human))
BDBM50302525
(5-(2-methoxystyryl)-4-(4-methyl-1H-indol-5-ylamino...)
Show SMILES COc1ccccc1\C=C\c1cncc(C#N)c1Nc1ccc2[nH]ccc2c1C
Show InChI InChI=1S/C24H20N4O/c1-16-20-11-12-27-22(20)10-9-21(16)28-24-18(14-26-15-19(24)13-25)8-7-17-5-3-4-6-23(17)29-2/h3-12,14-15,27H,1-2H3,(H,26,28)/b8-7+
NCI pathway
Reactome pathway
n/an/a 110n/an/an/an/an/an/a
Wyeth Research
Curated by ChEMBL
Assay Description
Inhibition of PKCdelta by IMAP kinase assay
Bioorg Med Chem Lett 19: 5829-32 (2009)
Article DOI: 10.1016/j.bmcl.2009.08.086
BindingDB Entry DOI: 10.7270/Q2ZS2WKC
Protein kinase C theta type
(Homo sapiens (Human))
BDBM50302525
(5-(2-methoxystyryl)-4-(4-methyl-1H-indol-5-ylamino...)
Show SMILES COc1ccccc1\C=C\c1cncc(C#N)c1Nc1ccc2[nH]ccc2c1C
Show InChI InChI=1S/C24H20N4O/c1-16-20-11-12-27-22(20)10-9-21(16)28-24-18(14-26-15-19(24)13-25)8-7-17-5-3-4-6-23(17)29-2/h3-12,14-15,27H,1-2H3,(H,26,28)/b8-7+
NCI pathway
Reactome pathway
n/an/a 8.20n/an/an/an/an/an/a
Wyeth Research
Curated by ChEMBL
Assay Description
Inhibition of human PKCtheta by IMAP kinase assay
Bioorg Med Chem Lett 19: 5829-32 (2009)
Article DOI: 10.1016/j.bmcl.2009.08.086
BindingDB Entry DOI: 10.7270/Q2ZS2WKC