BDBM50302616 (2S,3R,4R,5S)-2-(4-Chloro-3-(4-(2-hydroxyethoxy)benzyl)phenyl)-6-methoxytetrahydro-2Hpyran-3,4,5-triol::CHEMBL567743
SMILES: COC1O[C@H]([C@H](O)[C@@H](O)[C@@H]1O)c1ccc(Cl)c(Cc2ccc(OCCO)cc2)c1
InChI Key: InChIKey=CHFZDLOZVXBPTO-AUGMSIGLSA-N
Data: 2 IC50
Activity Spreadsheet -- Enzyme Inhibition Constant Data from BindingDB
Found 2 hits for monomerid = 50302616
Trg + Lig
Ki
nM
ΔG°
kcal/mole
IC50
nM
Kd
nM
EC50/IC50
nM
koff
s-1
kon
M-1s-1
pHTemp
°C
sodium-dependent glucose cotransporter 2 (SGLT2)
(Mus musculus (Mouse))
BDBM50302616
((2S,3R,4R,5S)-2-(4-Chloro-3-(4-(2-hydroxyethoxy)be...)
Show SMILES COC1O[C@H]([C@H](O)[C@@H](O)[C@@H]1O)c1ccc(Cl)c(Cc2ccc(OCCO)cc2)c1 |r|
Show InChI InChI=1S/C21H25ClO7/c1-27-21-19(26)17(24)18(25)20(29-21)13-4-7-16(22)14(11-13)10-12-2-5-15(6-3-12)28-9-8-23/h2-7,11,17-21,23-26H,8-10H2,1H3/t17-,18-,19+,20+,21?/m1/s1
Reactome pathway
n/an/a 9.5n/an/an/an/an/an/a
Princ
Curated by ChEMBL
Assay Description
Inhibition of mouse SGLT2-mediated [14C]alpha-methylglucopyranoside uptake by cell based assay
J Med Chem 52: 6201-4 (2009)
Article DOI: 10.1021/jm900951n
BindingDB Entry DOI: 10.7270/Q2F76DH1
Sodium/glucose cotransporter 2
(Homo sapiens (Human))
BDBM50302616
((2S,3R,4R,5S)-2-(4-Chloro-3-(4-(2-hydroxyethoxy)be...)
Show SMILES COC1O[C@H]([C@H](O)[C@@H](O)[C@@H]1O)c1ccc(Cl)c(Cc2ccc(OCCO)cc2)c1 |r|
Show InChI InChI=1S/C21H25ClO7/c1-27-21-19(26)17(24)18(25)20(29-21)13-4-7-16(22)14(11-13)10-12-2-5-15(6-3-12)28-9-8-23/h2-7,11,17-21,23-26H,8-10H2,1H3/t17-,18-,19+,20+,21?/m1/s1
n/an/a 36n/an/an/an/an/an/a
Princ
Curated by ChEMBL
Assay Description
Inhibition of human SGLT2 expressed in HEK293 cells assessed as inhibition of [14C]alpha-methylglucopyranoside uptake
J Med Chem 52: 6201-4 (2009)
Article DOI: 10.1021/jm900951n
BindingDB Entry DOI: 10.7270/Q2F76DH1