BDBM50302624 (2S,3R,4R,5S)-2-[4-Chloro-3-(4-ethoxy-benzyl)-phenyl]-6-ethoxy-tetrahydro-pyran-3,4,5-triol::CHEMBL566471
SMILES: CCOC1O[C@H]([C@H](O)[C@@H](O)[C@@H]1O)c1ccc(Cl)c(Cc2ccc(OCC)cc2)c1
InChI Key: InChIKey=OJECUDIXZNSYFI-RPKDUVEISA-N
Data: 2 IC50
Activity Spreadsheet -- Enzyme Inhibition Constant Data from BindingDB
Found 2 hits for monomerid = 50302624
Trg + Lig
Ki
nM
ΔG°
kcal/mole
IC50
nM
Kd
nM
EC50/IC50
nM
koff
s-1
kon
M-1s-1
pHTemp
°C
sodium-dependent glucose cotransporter 2 (SGLT2)
(Mus musculus (Mouse))
BDBM50302624
((2S,3R,4R,5S)-2-[4-Chloro-3-(4-ethoxy-benzyl)-phen...)
Show SMILES CCOC1O[C@H]([C@H](O)[C@@H](O)[C@@H]1O)c1ccc(Cl)c(Cc2ccc(OCC)cc2)c1 |r|
Show InChI InChI=1S/C22H27ClO6/c1-3-27-16-8-5-13(6-9-16)11-15-12-14(7-10-17(15)23)21-19(25)18(24)20(26)22(29-21)28-4-2/h5-10,12,18-22,24-26H,3-4,11H2,1-2H3/t18-,19-,20+,21+,22?/m1/s1
Reactome pathway
n/an/a 19n/an/an/an/an/an/a
Princ
Curated by ChEMBL
Assay Description
Inhibition of mouse SGLT2-mediated [14C]alpha-methylglucopyranoside uptake by cell based assay
J Med Chem 52: 6201-4 (2009)
Article DOI: 10.1021/jm900951n
BindingDB Entry DOI: 10.7270/Q2F76DH1
Sodium/glucose cotransporter 2
(Homo sapiens (Human))
BDBM50302624
((2S,3R,4R,5S)-2-[4-Chloro-3-(4-ethoxy-benzyl)-phen...)
Show SMILES CCOC1O[C@H]([C@H](O)[C@@H](O)[C@@H]1O)c1ccc(Cl)c(Cc2ccc(OCC)cc2)c1 |r|
Show InChI InChI=1S/C22H27ClO6/c1-3-27-16-8-5-13(6-9-16)11-15-12-14(7-10-17(15)23)21-19(25)18(24)20(26)22(29-21)28-4-2/h5-10,12,18-22,24-26H,3-4,11H2,1-2H3/t18-,19-,20+,21+,22?/m1/s1
n/an/a 58n/an/an/an/an/an/a
Princ
Curated by ChEMBL
Assay Description
Inhibition of human SGLT2 expressed in HEK293 cells assessed as inhibition of [14C]alpha-methylglucopyranoside uptake
J Med Chem 52: 6201-4 (2009)
Article DOI: 10.1021/jm900951n
BindingDB Entry DOI: 10.7270/Q2F76DH1