BDBM50302725 (S)-4-(6-(4-((ethylamino)methyl)piperidin-1-yl)-2-phenylpyrimidine-4-carboxamido)-5-oxo-5-(4-(pentyloxycarbonyl)piperazin-1-yl)pentanoic acid::CHEMBL570153
SMILES: CCCCCOC(=O)N1CCN(CC1)C(=O)[C@H](CCC(O)=O)NC(=O)c1cc(nc(n1)-c1ccccc1)N1CCC(CNCC)CC1
InChI Key: InChIKey=XSGYSIUXAVBGDR-MHZLTWQESA-N
Data: 1 KI  1 IC50
Activity Spreadsheet -- Enzyme Inhibition Constant Data from BindingDB
Found 2 hits for monomerid = 50302725
Trg + Lig
Ki
nM
ΔG°
kcal/mole
IC50
nM
Kd
nM
EC50/IC50
nM
koff
s-1
kon
M-1s-1
pHTemp
°C
Purinergic receptor P2Y12
(Homo sapiens (Human))
BDBM50302725
((S)-4-(6-(4-((ethylamino)methyl)piperidin-1-yl)-2-...)
Show SMILES CCCCCOC(=O)N1CCN(CC1)C(=O)[C@H](CCC(O)=O)NC(=O)c1cc(nc(n1)-c1ccccc1)N1CCC(CNCC)CC1 |r|
Show InChI InChI=1S/C34H49N7O6/c1-3-5-9-22-47-34(46)41-20-18-40(19-21-41)33(45)27(12-13-30(42)43)37-32(44)28-23-29(38-31(36-28)26-10-7-6-8-11-26)39-16-14-25(15-17-39)24-35-4-2/h6-8,10-11,23,25,27,35H,3-5,9,12-22,24H2,1-2H3,(H,37,44)(H,42,43)/t27-/m0/s1
Reactome pathway
2.20n/an/an/an/an/an/an/an/a
Pfizer Global Research and Development
Curated by ChEMBL
Assay Description
Binding affinity at human recombinant P2Y12 receptor expressed in CHO cells by radioligand binding assay
Bioorg Med Chem Lett 19: 6148-56 (2009)
Article DOI: 10.1016/j.bmcl.2009.09.017
BindingDB Entry DOI: 10.7270/Q2B27VCB
Purinergic receptor P2Y12
(Homo sapiens (Human))
BDBM50302725
((S)-4-(6-(4-((ethylamino)methyl)piperidin-1-yl)-2-...)
Show SMILES CCCCCOC(=O)N1CCN(CC1)C(=O)[C@H](CCC(O)=O)NC(=O)c1cc(nc(n1)-c1ccccc1)N1CCC(CNCC)CC1 |r|
Show InChI InChI=1S/C34H49N7O6/c1-3-5-9-22-47-34(46)41-20-18-40(19-21-41)33(45)27(12-13-30(42)43)37-32(44)28-23-29(38-31(36-28)26-10-7-6-8-11-26)39-16-14-25(15-17-39)24-35-4-2/h6-8,10-11,23,25,27,35H,3-5,9,12-22,24H2,1-2H3,(H,37,44)(H,42,43)/t27-/m0/s1
Reactome pathway
n/an/a 770n/an/an/an/an/an/a
Pfizer Global Research and Development
Curated by ChEMBL
Assay Description
Antagonist activity at P2Y12 receptor in human platelet rich plasma assessed as inhibition of ADP-induced platelet aggregation by light transmission ...
Bioorg Med Chem Lett 19: 6148-56 (2009)
Article DOI: 10.1016/j.bmcl.2009.09.017
BindingDB Entry DOI: 10.7270/Q2B27VCB