null
SMILES: Fc1cccc([C@@H]2CC[C@@H](NC(=O)N3CCC4(CC3)N=C(NC4=O)c3ccccc3)C(=O)N(CC(F)(F)F)C2)c1F
InChI Key: InChIKey=MVAQCRCFWCLMTI-WIYYLYMNSA-N
Activity Spreadsheet -- Enzyme Inhibition Constant Data from BindingDB
Found 3 hits for monomerid = 50302878
Trg + Lig
Ki
nM
ΔG°
kcal/mole
IC50
nM
Kd
nM
EC50/IC50
nM
koff
s-1
kon
M-1s-1
pHTemp
°C
Calcitonin gene-related peptide type 1 receptor
(Homo sapiens (Human))
BDBM50302878
(CHEMBL577110 | N-((3R,6S)-6-(2,3-difluorophenyl)-2...)
Show SMILES Fc1cccc([C@@H]2CC[C@@H](NC(=O)N3CCC4(CC3)N=C(NC4=O)c3ccccc3)C(=O)N(CC(F)(F)F)C2)c1F |r,c:20|
Show InChI InChI=1S/C28H28F5N5O3/c29-20-8-4-7-19(22(20)30)18-9-10-21(24(39)38(15-18)16-28(31,32)33)34-26(41)37-13-11-27(12-14-37)25(40)35-23(36-27)17-5-2-1-3-6-17/h1-8,18,21H,9-16H2,(H,34,41)(H,35,36,40)/t18-,21-/m1/s1
30n/an/an/an/an/an/an/an/a
Merck Research Laboratories
Curated by ChEMBL
Assay Description
Displacement of [125I]human CGRP from human CLR expressed in HEK 293 cells coexpressing human RAMP1 after 3 hrs by scintillation counting
Bioorg Med Chem Lett 19: 6368-72 (2009)
Article DOI: 10.1016/j.bmcl.2009.09.066
BindingDB Entry DOI: 10.7270/Q2PC32FD
Calcitonin gene-related peptide type 1 receptor
(Homo sapiens (Human))
BDBM50302878
(CHEMBL577110 | N-((3R,6S)-6-(2,3-difluorophenyl)-2...)
Show SMILES Fc1cccc([C@@H]2CC[C@@H](NC(=O)N3CCC4(CC3)N=C(NC4=O)c3ccccc3)C(=O)N(CC(F)(F)F)C2)c1F |r,c:20|
Show InChI InChI=1S/C28H28F5N5O3/c29-20-8-4-7-19(22(20)30)18-9-10-21(24(39)38(15-18)16-28(31,32)33)34-26(41)37-13-11-27(12-14-37)25(40)35-23(36-27)17-5-2-1-3-6-17/h1-8,18,21H,9-16H2,(H,34,41)(H,35,36,40)/t18-,21-/m1/s1
n/an/a 23n/an/an/an/an/an/a
Merck Research Laboratories
Curated by ChEMBL
Assay Description
Antagonist activity at human CLR expressed in HEK293 cells coexpressing human RAMP1 assessed as inhibition of human CGRPalpha-induced cAMP production...
Bioorg Med Chem Lett 19: 6368-72 (2009)
Article DOI: 10.1016/j.bmcl.2009.09.066
BindingDB Entry DOI: 10.7270/Q2PC32FD
Calcitonin gene-related peptide type 1 receptor
(Homo sapiens (Human))
BDBM50302878
(CHEMBL577110 | N-((3R,6S)-6-(2,3-difluorophenyl)-2...)
Show SMILES Fc1cccc([C@@H]2CC[C@@H](NC(=O)N3CCC4(CC3)N=C(NC4=O)c3ccccc3)C(=O)N(CC(F)(F)F)C2)c1F |r,c:20|
Show InChI InChI=1S/C28H28F5N5O3/c29-20-8-4-7-19(22(20)30)18-9-10-21(24(39)38(15-18)16-28(31,32)33)34-26(41)37-13-11-27(12-14-37)25(40)35-23(36-27)17-5-2-1-3-6-17/h1-8,18,21H,9-16H2,(H,34,41)(H,35,36,40)/t18-,21-/m1/s1
n/an/a 871n/an/an/an/an/an/a
Merck Research Laboratories
Curated by ChEMBL
Assay Description
Antagonist activity at human CLR expressed in HEK293 cells coexpressing human RAMP1 assessed as inhibition of human CGRPalpha-induced cAMP production...
Bioorg Med Chem Lett 19: 6368-72 (2009)
Article DOI: 10.1016/j.bmcl.2009.09.066
BindingDB Entry DOI: 10.7270/Q2PC32FD