null
SMILES: Fc1cccc([C@@H]2CC[C@@H](NC(=O)N3CCC4(CC3)OC(=O)Nc3ccccc43)C(=O)N(CC(F)(F)F)C2)c1F
InChI Key: InChIKey=JBIBSZVZIAZPBO-IIBYNOLFSA-N
Activity Spreadsheet -- Enzyme Inhibition Constant Data from BindingDB
Found 3 hits for monomerid = 50302880
Trg + Lig
Ki
nM
ΔG°
kcal/mole
IC50
nM
Kd
nM
EC50/IC50
nM
koff
s-1
kon
M-1s-1
pHTemp
°C
Calcitonin gene-related peptide type 1 receptor
(Homo sapiens (Human))
BDBM50302880
(CHEMBL571459 | N-((3R,6S)-6-(2,3-difluorophenyl)-2...)
Show SMILES Fc1cccc([C@@H]2CC[C@@H](NC(=O)N3CCC4(CC3)OC(=O)Nc3ccccc43)C(=O)N(CC(F)(F)F)C2)c1F |r|
Show InChI InChI=1S/C27H27F5N4O4/c28-19-6-3-4-17(22(19)29)16-8-9-21(23(37)36(14-16)15-27(30,31)32)33-24(38)35-12-10-26(11-13-35)18-5-1-2-7-20(18)34-25(39)40-26/h1-7,16,21H,8-15H2,(H,33,38)(H,34,39)/t16-,21-/m1/s1
46n/an/an/an/an/an/an/an/a
Merck Research Laboratories
Curated by ChEMBL
Assay Description
Displacement of [125I]human CGRP from human CLR expressed in HEK 293 cells coexpressing human RAMP1 after 3 hrs by scintillation counting
Bioorg Med Chem Lett 19: 6368-72 (2009)
Article DOI: 10.1016/j.bmcl.2009.09.066
BindingDB Entry DOI: 10.7270/Q2PC32FD
Calcitonin gene-related peptide type 1 receptor
(Homo sapiens (Human))
BDBM50302880
(CHEMBL571459 | N-((3R,6S)-6-(2,3-difluorophenyl)-2...)
Show SMILES Fc1cccc([C@@H]2CC[C@@H](NC(=O)N3CCC4(CC3)OC(=O)Nc3ccccc43)C(=O)N(CC(F)(F)F)C2)c1F |r|
Show InChI InChI=1S/C27H27F5N4O4/c28-19-6-3-4-17(22(19)29)16-8-9-21(23(37)36(14-16)15-27(30,31)32)33-24(38)35-12-10-26(11-13-35)18-5-1-2-7-20(18)34-25(39)40-26/h1-7,16,21H,8-15H2,(H,33,38)(H,34,39)/t16-,21-/m1/s1
n/an/a 60n/an/an/an/an/an/a
Merck Research Laboratories
Curated by ChEMBL
Assay Description
Antagonist activity at human CLR expressed in HEK293 cells coexpressing human RAMP1 assessed as inhibition of human CGRPalpha-induced cAMP production...
Bioorg Med Chem Lett 19: 6368-72 (2009)
Article DOI: 10.1016/j.bmcl.2009.09.066
BindingDB Entry DOI: 10.7270/Q2PC32FD
Calcitonin gene-related peptide type 1 receptor
(Homo sapiens (Human))
BDBM50302880
(CHEMBL571459 | N-((3R,6S)-6-(2,3-difluorophenyl)-2...)
Show SMILES Fc1cccc([C@@H]2CC[C@@H](NC(=O)N3CCC4(CC3)OC(=O)Nc3ccccc43)C(=O)N(CC(F)(F)F)C2)c1F |r|
Show InChI InChI=1S/C27H27F5N4O4/c28-19-6-3-4-17(22(19)29)16-8-9-21(23(37)36(14-16)15-27(30,31)32)33-24(38)35-12-10-26(11-13-35)18-5-1-2-7-20(18)34-25(39)40-26/h1-7,16,21H,8-15H2,(H,33,38)(H,34,39)/t16-,21-/m1/s1
n/an/a 792n/an/an/an/an/an/a
Merck Research Laboratories
Curated by ChEMBL
Assay Description
Antagonist activity at human CLR expressed in HEK293 cells coexpressing human RAMP1 assessed as inhibition of human CGRPalpha-induced cAMP production...
Bioorg Med Chem Lett 19: 6368-72 (2009)
Article DOI: 10.1016/j.bmcl.2009.09.066
BindingDB Entry DOI: 10.7270/Q2PC32FD