BDBM50302914 2-(tert-Butylamino)-3',4'-dichlorobutyrophenone::2-(tert-butylamino)-1-(3,4-dichlorophenyl)butan-1-one::CHEMBL566208
SMILES: CCC(NC(C)(C)C)C(=O)c1ccc(Cl)c(Cl)c1
InChI Key: InChIKey=JYBXLCIZWPNCMU-UHFFFAOYSA-N
Data: 3 KI  7 IC50
Activity Spreadsheet -- Enzyme Inhibition Constant Data from BindingDB
Found 10 hits for monomerid = 50302914
Trg + Lig
Ki
nM
ΔG°
kcal/mole
IC50
nM
Kd
nM
EC50/IC50
nM
koff
s-1
kon
M-1s-1
pHTemp
°C
Sodium-dependent dopamine transporter
(Homo sapiens (Human))
BDBM50302914
(2-(tert-Butylamino)-3',4'-dichlorobutyrophenone | ...)
Show SMILES CCC(NC(C)(C)C)C(=O)c1ccc(Cl)c(Cl)c1
Show InChI InChI=1S/C14H19Cl2NO/c1-5-12(17-14(2,3)4)13(18)9-6-7-10(15)11(16)8-9/h6-8,12,17H,5H2,1-4H3
NCI pathway
Reactome pathway
278n/an/an/an/an/an/an/an/a
Research Triangle Institute
Curated by ChEMBL
Assay Description
Displacement of [125I]RTI55 from cloned human DAT expressed in HEK293 cells
J Med Chem 52: 6768-81 (2009)
Checked by Author
Article DOI: 10.1021/jm901189z
BindingDB Entry DOI: 10.7270/Q2ZK5HMB
Sodium-dependent serotonin transporter
(Homo sapiens (Human))
BDBM50302914
(2-(tert-Butylamino)-3',4'-dichlorobutyrophenone | ...)
Show SMILES CCC(NC(C)(C)C)C(=O)c1ccc(Cl)c(Cl)c1
Show InChI InChI=1S/C14H19Cl2NO/c1-5-12(17-14(2,3)4)13(18)9-6-7-10(15)11(16)8-9/h6-8,12,17H,5H2,1-4H3
860n/an/an/an/an/an/an/an/a
Research Triangle Institute
Curated by ChEMBL
Assay Description
Displacement of [125I]RTI55 from cloned human SERT expressed in HEK293 cells
J Med Chem 52: 6768-81 (2009)
Checked by Author
Article DOI: 10.1021/jm901189z
BindingDB Entry DOI: 10.7270/Q2ZK5HMB
Sodium-dependent noradrenaline transporter
(Homo sapiens (Human))
BDBM50302914
(2-(tert-Butylamino)-3',4'-dichlorobutyrophenone | ...)
Show SMILES CCC(NC(C)(C)C)C(=O)c1ccc(Cl)c(Cl)c1
Show InChI InChI=1S/C14H19Cl2NO/c1-5-12(17-14(2,3)4)13(18)9-6-7-10(15)11(16)8-9/h6-8,12,17H,5H2,1-4H3
Reactome pathway
2.24E+3n/an/an/an/an/an/an/an/a
Research Triangle Institute
Curated by ChEMBL
Assay Description
Displacement of [125I]RTI55 from cloned human NET expressed in HEK293 cells
J Med Chem 52: 6768-81 (2009)
Checked by Author
Article DOI: 10.1021/jm901189z
BindingDB Entry DOI: 10.7270/Q2ZK5HMB
Neuronal acetylcholine receptor Alpha-4/Beta-2
(Homo sapiens (Human))
BDBM50302914
(2-(tert-Butylamino)-3',4'-dichlorobutyrophenone | ...)
Show SMILES CCC(NC(C)(C)C)C(=O)c1ccc(Cl)c(Cl)c1
Show InChI InChI=1S/C14H19Cl2NO/c1-5-12(17-14(2,3)4)13(18)9-6-7-10(15)11(16)8-9/h6-8,12,17H,5H2,1-4H3
NCI pathway
Reactome pathway
n/an/a 10n/an/an/an/an/an/a
Research Triangle Institute
Curated by ChEMBL
Assay Description
Antagonist activity at human alpha4beta2 nAChR receptor expressed in human SH-SY5Y cells assessed as inhibition of carbamylcholine-induced 86Rb+ effl...
J Med Chem 53: 2204-14 (2010)
Article DOI: 10.1021/jm9017465
BindingDB Entry DOI: 10.7270/Q2FN1693
Sodium-dependent noradrenaline transporter
(Homo sapiens (Human))
BDBM50302914
(2-(tert-Butylamino)-3',4'-dichlorobutyrophenone | ...)
Show SMILES CCC(NC(C)(C)C)C(=O)c1ccc(Cl)c(Cl)c1
Show InChI InChI=1S/C14H19Cl2NO/c1-5-12(17-14(2,3)4)13(18)9-6-7-10(15)11(16)8-9/h6-8,12,17H,5H2,1-4H3
Reactome pathway
n/an/a 135n/an/an/an/an/an/a
Research Triangle Institute
Curated by ChEMBL
Assay Description
Inhibition of [3H]norepinephrine reuptake at human NET expressed in HEK293 cells
J Med Chem 52: 6768-81 (2009)
Checked by Author
Article DOI: 10.1021/jm901189z
BindingDB Entry DOI: 10.7270/Q2ZK5HMB
Sodium-dependent dopamine transporter
(Homo sapiens (Human))
BDBM50302914
(2-(tert-Butylamino)-3',4'-dichlorobutyrophenone | ...)
Show SMILES CCC(NC(C)(C)C)C(=O)c1ccc(Cl)c(Cl)c1
Show InChI InChI=1S/C14H19Cl2NO/c1-5-12(17-14(2,3)4)13(18)9-6-7-10(15)11(16)8-9/h6-8,12,17H,5H2,1-4H3
NCI pathway
Reactome pathway
n/an/a 118n/an/an/an/an/an/a
Research Triangle Institute
Curated by ChEMBL
Assay Description
Inhibition of [3H]dopamine uptake at human DAT expressed in HEK293 cells
J Med Chem 53: 2204-14 (2010)
Article DOI: 10.1021/jm9017465
BindingDB Entry DOI: 10.7270/Q2FN1693
Sodium-dependent serotonin transporter
(Homo sapiens (Human))
BDBM50302914
(2-(tert-Butylamino)-3',4'-dichlorobutyrophenone | ...)
Show SMILES CCC(NC(C)(C)C)C(=O)c1ccc(Cl)c(Cl)c1
Show InChI InChI=1S/C14H19Cl2NO/c1-5-12(17-14(2,3)4)13(18)9-6-7-10(15)11(16)8-9/h6-8,12,17H,5H2,1-4H3
n/an/a 790n/an/an/an/an/an/a
Research Triangle Institute
Curated by ChEMBL
Assay Description
Inhibition of [3H]serotonin reuptake at human SERT expressed in HEK293 cells
J Med Chem 52: 6768-81 (2009)
Checked by Author
Article DOI: 10.1021/jm901189z
BindingDB Entry DOI: 10.7270/Q2ZK5HMB
Sodium-dependent serotonin transporter
(Homo sapiens (Human))
BDBM50302914
(2-(tert-Butylamino)-3',4'-dichlorobutyrophenone | ...)
Show SMILES CCC(NC(C)(C)C)C(=O)c1ccc(Cl)c(Cl)c1
Show InChI InChI=1S/C14H19Cl2NO/c1-5-12(17-14(2,3)4)13(18)9-6-7-10(15)11(16)8-9/h6-8,12,17H,5H2,1-4H3
n/an/a 1.09E+3n/an/an/an/an/an/a
Research Triangle Institute
Curated by ChEMBL
Assay Description
Inhibition of [3H]serotonin uptake at human SERT expressed in HEK293 cells
J Med Chem 53: 2204-14 (2010)
Article DOI: 10.1021/jm9017465
BindingDB Entry DOI: 10.7270/Q2FN1693
Sodium-dependent dopamine transporter
(Homo sapiens (Human))
BDBM50302914
(2-(tert-Butylamino)-3',4'-dichlorobutyrophenone | ...)
Show SMILES CCC(NC(C)(C)C)C(=O)c1ccc(Cl)c(Cl)c1
Show InChI InChI=1S/C14H19Cl2NO/c1-5-12(17-14(2,3)4)13(18)9-6-7-10(15)11(16)8-9/h6-8,12,17H,5H2,1-4H3
NCI pathway
Reactome pathway
n/an/a 175n/an/an/an/an/an/a
Research Triangle Institute
Curated by ChEMBL
Assay Description
Inhibition of [3H]dopamine reuptake at human DAT expressed in HEK293 cells
J Med Chem 52: 6768-81 (2009)
Checked by Author
Article DOI: 10.1021/jm901189z
BindingDB Entry DOI: 10.7270/Q2ZK5HMB
Sodium-dependent noradrenaline transporter
(Homo sapiens (Human))
BDBM50302914
(2-(tert-Butylamino)-3',4'-dichlorobutyrophenone | ...)
Show SMILES CCC(NC(C)(C)C)C(=O)c1ccc(Cl)c(Cl)c1
Show InChI InChI=1S/C14H19Cl2NO/c1-5-12(17-14(2,3)4)13(18)9-6-7-10(15)11(16)8-9/h6-8,12,17H,5H2,1-4H3
Reactome pathway
n/an/a 389n/an/an/an/an/an/a
Research Triangle Institute
Curated by ChEMBL
Assay Description
Inhibition of [3H]norepinephrine uptake at human NET expressed in HEK293 cells
J Med Chem 53: 2204-14 (2010)
Article DOI: 10.1021/jm9017465
BindingDB Entry DOI: 10.7270/Q2FN1693