BDBM50303099 3-(4-chloro-3-methoxyphenyl)-7-(8-ethyl-8-azabicyclo[3.2.1]octan-3-yl)-2-(pyridin-4-yl)-1,2-dihydropyrazolo[1,5-a]pyrimidine::CHEMBL569768
SMILES: CCN1C2CCC1CC(C2)c1ccnc2c(c(nn12)-c1ccncc1)-c1ccc(Cl)c(OC)c1
InChI Key: InChIKey=OCKPPBHBNNMQNO-UHFFFAOYSA-N
Data: 1 IC50
Activity Spreadsheet -- Enzyme Inhibition Constant Data from BindingDB
Found 1 hit for monomerid = 50303099
Trg + Lig
Ki
nM
ΔG°
kcal/mole
IC50
nM
Kd
nM
EC50/IC50
nM
koff
s-1
kon
M-1s-1
pHTemp
°C
Serine/threonine-protein kinase B-raf
(Homo sapiens (Human))
BDBM50303099
(3-(4-chloro-3-methoxyphenyl)-7-(8-ethyl-8-azabicyc...)
Show SMILES CCN1C2CCC1CC(C2)c1ccnc2c(c(nn12)-c1ccncc1)-c1ccc(Cl)c(OC)c1 |THB:10:8:2:4.5|
Show InChI InChI=1S/C27H28ClN5O/c1-3-32-20-5-6-21(32)15-19(14-20)23-10-13-30-27-25(18-4-7-22(28)24(16-18)34-2)26(31-33(23)27)17-8-11-29-12-9-17/h4,7-13,16,19-21H,3,5-6,14-15H2,1-2H3
NCI pathway
Reactome pathway
n/an/a 43.5n/an/an/an/an/an/a
Wyeth Research
Curated by ChEMBL
Assay Description
Inhibition of B-Raf
Bioorg Med Chem Lett 19: 6957-61 (2009)
Article DOI: 10.1016/j.bmcl.2009.10.058
BindingDB Entry DOI: 10.7270/Q2833S34