BDBM50303271 CHEMBL565603::N1-(4-(2-(1-ethyl-1H-imidazole-4-carbonyl)thieno[3,2-b]pyridin-7-yloxy)-3-fluorophenyl)-N3-(3-fluorophenyl)malonamide
SMILES: CCn1cnc(c1)-c1cc2nccc(Oc3ccc(NC(=O)CC(=O)Nc4cccc(F)c4)cc3F)c2s1
InChI Key: InChIKey=YLOWYMLGKQEHQR-UHFFFAOYSA-N
Data: 3 IC50
Activity Spreadsheet -- Enzyme Inhibition Constant Data from BindingDB
Found 3 hits for monomerid = 50303271
Trg + Lig
Ki
nM
ΔG°
kcal/mole
IC50
nM
Kd
nM
EC50/IC50
nM
koff
s-1
kon
M-1s-1
pHTemp
°C
Vascular endothelial growth factor receptor 2
(Homo sapiens (Human))
BDBM50303271
(CHEMBL565603 | N1-(4-(2-(1-ethyl-1H-imidazole-4-ca...)
Show SMILES CCn1cnc(c1)-c1cc2nccc(Oc3ccc(NC(=O)CC(=O)Nc4cccc(F)c4)cc3F)c2s1
Show InChI InChI=1S/C27H21F2N5O3S/c1-2-34-14-21(31-15-34)24-12-20-27(38-24)23(8-9-30-20)37-22-7-6-18(11-19(22)29)33-26(36)13-25(35)32-17-5-3-4-16(28)10-17/h3-12,14-15H,2,13H2,1H3,(H,32,35)(H,33,36)
NCI pathway
Reactome pathway
n/an/a 10n/an/an/an/an/an/a
MethylGene Inc.
Curated by ChEMBL
Assay Description
Inhibition of GST-fused recombinant VEGFR2 expressed in baculovirus infected Sf9 cells after 10 mins by DELFIA assay
Bioorg Med Chem Lett 19: 6836-9 (2009)
Article DOI: 10.1016/j.bmcl.2009.10.095
BindingDB Entry DOI: 10.7270/Q2GM87C1
Hepatocyte growth factor receptor
(Homo sapiens (Human))
BDBM50303271
(CHEMBL565603 | N1-(4-(2-(1-ethyl-1H-imidazole-4-ca...)
Show SMILES CCn1cnc(c1)-c1cc2nccc(Oc3ccc(NC(=O)CC(=O)Nc4cccc(F)c4)cc3F)c2s1
Show InChI InChI=1S/C27H21F2N5O3S/c1-2-34-14-21(31-15-34)24-12-20-27(38-24)23(8-9-30-20)37-22-7-6-18(11-19(22)29)33-26(36)13-25(35)32-17-5-3-4-16(28)10-17/h3-12,14-15H,2,13H2,1H3,(H,32,35)(H,33,36)
n/an/a 870n/an/an/an/an/an/a
MethylGene Inc.
Curated by ChEMBL
Assay Description
Inhibition of TPR-met autophosphorylation expressed in HEK293T cells after 150 mins by ELISA
Bioorg Med Chem Lett 19: 6836-9 (2009)
Article DOI: 10.1016/j.bmcl.2009.10.095
BindingDB Entry DOI: 10.7270/Q2GM87C1
Hepatocyte growth factor receptor
(Homo sapiens (Human))
BDBM50303271
(CHEMBL565603 | N1-(4-(2-(1-ethyl-1H-imidazole-4-ca...)
Show SMILES CCn1cnc(c1)-c1cc2nccc(Oc3ccc(NC(=O)CC(=O)Nc4cccc(F)c4)cc3F)c2s1
Show InChI InChI=1S/C27H21F2N5O3S/c1-2-34-14-21(31-15-34)24-12-20-27(38-24)23(8-9-30-20)37-22-7-6-18(11-19(22)29)33-26(36)13-25(35)32-17-5-3-4-16(28)10-17/h3-12,14-15H,2,13H2,1H3,(H,32,35)(H,33,36)
n/an/a 52n/an/an/an/an/an/a
MethylGene Inc.
Curated by ChEMBL
Assay Description
Inhibition of GST-fused recombinant C-met expressed in baculovirus infected high five cells after 30 mins by DELFIA assay
Bioorg Med Chem Lett 19: 6836-9 (2009)
Article DOI: 10.1016/j.bmcl.2009.10.095
BindingDB Entry DOI: 10.7270/Q2GM87C1