BDBM50303362 1-(2-((Benzo[d]thiazol-2-ylthio)methyl)phenyl)-3,3-diethylazetidine-2,4-dione::CHEMBL583023
SMILES: CCC1(CC)C(=O)N(C1=O)c1ccccc1CSc1nc2ccccc2s1
InChI Key: InChIKey=SFEIEFMAOHVMLN-UHFFFAOYSA-N
Data: 1 KI  1 Kd
Activity Spreadsheet -- Enzyme Inhibition Constant Data from BindingDB
Found 2 hits for monomerid = 50303362
Trg + Lig
Ki
nM
ΔG°
kcal/mole
IC50
nM
Kd
nM
EC50/IC50
nM
koff
s-1
kon
M-1s-1
pHTemp
°C
Leukocyte elastase
(Homo sapiens (Human))
BDBM50303362
(1-(2-((Benzo[d]thiazol-2-ylthio)methyl)phenyl)-3,3...)
Show SMILES CCC1(CC)C(=O)N(C1=O)c1ccccc1CSc1nc2ccccc2s1
Show InChI InChI=1S/C21H20N2O2S2/c1-3-21(4-2)18(24)23(19(21)25)16-11-7-5-9-14(16)13-26-20-22-15-10-6-8-12-17(15)27-20/h5-12H,3-4,13H2,1-2H3
Reactome pathway
99.3n/an/an/an/an/an/an/an/a
University of Lisbon
Curated by ChEMBL
Assay Description
Inhibition of human leukocyte elastase after 20 mins
J Med Chem 53: 241-53 (2010)
Article DOI: 10.1021/jm901082k
BindingDB Entry DOI: 10.7270/Q23B607D
Leukocyte elastase
(Homo sapiens (Human))
BDBM50303362
(1-(2-((Benzo[d]thiazol-2-ylthio)methyl)phenyl)-3,3...)
Show SMILES CCC1(CC)C(=O)N(C1=O)c1ccccc1CSc1nc2ccccc2s1
Show InChI InChI=1S/C21H20N2O2S2/c1-3-21(4-2)18(24)23(19(21)25)16-11-7-5-9-14(16)13-26-20-22-15-10-6-8-12-17(15)27-20/h5-12H,3-4,13H2,1-2H3
Reactome pathway
n/an/an/a 283n/an/an/an/an/a
University of Lisbon
Curated by ChEMBL
Assay Description
Inhibition of human leukocyte elastase after 20 mins
J Med Chem 53: 241-53 (2010)
Article DOI: 10.1021/jm901082k
BindingDB Entry DOI: 10.7270/Q23B607D