BDBM50303434 4-(cyclopentylamino)-6-(3-nitrophenylamino)-1,3,5-triazine-2-carbonitrile::CHEMBL567783
SMILES: [O-][N+](=O)c1cccc(Nc2nc(NC3CCCC3)nc(n2)C#N)c1
InChI Key: InChIKey=QWCPKWFUOYUVIN-UHFFFAOYSA-N
Data: 2 IC50
Activity Spreadsheet -- Enzyme Inhibition Constant Data from BindingDB
Found 2 hits for monomerid = 50303434
Trg + Lig
Ki
nM
ΔG°
kcal/mole
IC50
nM
Kd
nM
EC50/IC50
nM
koff
s-1
kon
M-1s-1
pHTemp
°C
Cruzipain
(Trypanosoma cruzi)
BDBM50303434
(4-(cyclopentylamino)-6-(3-nitrophenylamino)-1,3,5-...)
Show SMILES [O-][N+](=O)c1cccc(Nc2nc(NC3CCCC3)nc(n2)C#N)c1
Show InChI InChI=1S/C15H15N7O2/c16-9-13-19-14(17-10-4-1-2-5-10)21-15(20-13)18-11-6-3-7-12(8-11)22(23)24/h3,6-8,10H,1-2,4-5H2,(H2,17,18,19,20,21)
n/an/a 1n/an/an/an/an/an/a
National Human Genome Research Institute
Curated by ChEMBL
Assay Description
Inhibition of recombinant Trypanosoma cruzi cruzain after 5 mins by spectrofluorimetric analysis
J Med Chem 53: 52-60 (2010)
Article DOI: 10.1021/jm901069a
BindingDB Entry DOI: 10.7270/Q2TX3FG5
Cruzipain
(Trypanosoma cruzi)
BDBM50303434
(4-(cyclopentylamino)-6-(3-nitrophenylamino)-1,3,5-...)
Show SMILES [O-][N+](=O)c1cccc(Nc2nc(NC3CCCC3)nc(n2)C#N)c1
Show InChI InChI=1S/C15H15N7O2/c16-9-13-19-14(17-10-4-1-2-5-10)21-15(20-13)18-11-6-3-7-12(8-11)22(23)24/h3,6-8,10H,1-2,4-5H2,(H2,17,18,19,20,21)
n/an/a 63n/an/an/an/an/an/a
National Human Genome Research Institute
Curated by ChEMBL
Assay Description
Inhibition of Trypanosoma cruzi cruzain after 15 mins
J Med Chem 53: 52-60 (2010)
Article DOI: 10.1021/jm901069a
BindingDB Entry DOI: 10.7270/Q2TX3FG5