BDBM50303548 (2,2,3,3-Ttetramethylcyclopropyl)(1-(2-(thiophen-3-yl)ethyl)-1H-indol-3-yl)methanone::CHEMBL571342
SMILES: CC1(C)C(C(=O)c2cn(CCc3ccsc3)c3ccccc23)C1(C)C
InChI Key: InChIKey=KWTXZVBKQWNQBB-UHFFFAOYSA-N
Data: 2 KI  1 EC50
Activity Spreadsheet -- Enzyme Inhibition Constant Data from BindingDB
Found 3 hits for monomerid = 50303548
Trg + Lig
Ki
nM
ΔG°
kcal/mole
IC50
nM
Kd
nM
EC50/IC50
nM
koff
s-1
kon
M-1s-1
pHTemp
°C
Cannabinoid receptor 2
(Homo sapiens (Human))
BDBM50303548
((2,2,3,3-Ttetramethylcyclopropyl)(1-(2-(thiophen-3...)
Show SMILES CC1(C)C(C(=O)c2cn(CCc3ccsc3)c3ccccc23)C1(C)C
Show InChI InChI=1S/C22H25NOS/c1-21(2)20(22(21,3)4)19(24)17-13-23(11-9-15-10-12-25-14-15)18-8-6-5-7-16(17)18/h5-8,10,12-14,20H,9,11H2,1-4H3
Reactome pathway
1.80n/an/an/an/an/an/an/an/a
Abbott Laboratories
Curated by ChEMBL
Assay Description
Displacement of [3H]CP-55940 from human recombinant CB2 receptor expressed in HEK293 cells
J Med Chem 53: 295-315 (2010)
Article DOI: 10.1021/jm901214q
BindingDB Entry DOI: 10.7270/Q2KD1Z00
Cannabinoid receptor 1
(Homo sapiens (Human))
BDBM50303548
((2,2,3,3-Ttetramethylcyclopropyl)(1-(2-(thiophen-3...)
Show SMILES CC1(C)C(C(=O)c2cn(CCc3ccsc3)c3ccccc23)C1(C)C
Show InChI InChI=1S/C22H25NOS/c1-21(2)20(22(21,3)4)19(24)17-13-23(11-9-15-10-12-25-14-15)18-8-6-5-7-16(17)18/h5-8,10,12-14,20H,9,11H2,1-4H3
NCI pathway
Reactome pathway
148n/an/an/an/an/an/an/an/a
Abbott Laboratories
Curated by ChEMBL
Assay Description
Displacement of [3H]CP-55940 from human recombinant CB1 receptor expressed in CHO cells
J Med Chem 53: 295-315 (2010)
Article DOI: 10.1021/jm901214q
BindingDB Entry DOI: 10.7270/Q2KD1Z00
Cannabinoid receptor 2
(Homo sapiens (Human))
BDBM50303548
((2,2,3,3-Ttetramethylcyclopropyl)(1-(2-(thiophen-3...)
Show SMILES CC1(C)C(C(=O)c2cn(CCc3ccsc3)c3ccccc23)C1(C)C
Show InChI InChI=1S/C22H25NOS/c1-21(2)20(22(21,3)4)19(24)17-13-23(11-9-15-10-12-25-14-15)18-8-6-5-7-16(17)18/h5-8,10,12-14,20H,9,11H2,1-4H3
Reactome pathway
n/an/an/an/a 70n/an/an/an/a
Abbott Laboratories
Curated by ChEMBL
Assay Description
Agonist activity at human recombinant CB2 receptor expressed in HEK293 cells coexpressing Galphaq/o5 assessed as calcium mobilization by FLIPR assay
J Med Chem 53: 295-315 (2010)
Article DOI: 10.1021/jm901214q
BindingDB Entry DOI: 10.7270/Q2KD1Z00